program: Gaussian 09
title: 000145786
version: EM64L-G09RevD.01
frameworkgroup: C1[X(C3H5NO)]
method: RPBEPBE
basis: SDD
operation: Freq
keyword: #pfreq=noraman
keyword: PBEPBE/SDD
title: #p freq=noraman PBEPBE/SDD
converged: YES YES NO YES
title: Mulliken charges:
elementType: O N C C C H H H H H
charge: -0.419837 -0.067680 -0.072908 -0.190772 -0.544353 0.242388 0.240042 0.224537 0.217099 0.371484
chargesum: 0.00000
title: Mulliken charges with hydrogens summed into heavy atoms:
elementType: O N C C C
charge: -0.048353 -0.067680 0.169480 0.049270 -0.102717
polarizability: 9.32450248e+01 7.72583433e+00 3.75111249e+01 -1.08091073e-03 -2.01581962e-03 1.74864035e+01
1716.lowfreq: -12.7740 -0.0014 -0.0009 -0.0006 2.2377 20.5853 175.1381 202.8347 282.6402
frequency: 175.1293 202.8346 282.6394 449.4247 468.8810 500.3641 662.3457 896.9668 930.5661 949.6316 953.4088 1013.9196 1186.7558 1212.4804 1271.8830 1346.4371 1438.6949 1556.9533 1634.3972 3069.6508 3100.2686 3131.5525 3213.4992 3564.3275
redmass: 3.0219 3.4212 2.9932 1.1176 2.9935 5.3824 1.4151 5.8558 1.3546 1.6079 1.5014 1.1179 1.9084 1.1906 1.3101 1.4621 1.3293 5.1350 4.4123 1.0913 1.0602 1.0936 1.1144 1.0675
irintensity: 1.0550 2.2038 0.8563 181.4163 1.2195 22.5698 8.9124 125.9357 18.9013 63.0779 74.4137 39.7406 16.6208 29.4827 4.3023 45.6715 8.3615 0.0827 9.1993 9.6759 6.1180 6.1156 18.9223 70.2923
temp: 298.150 k
press: 1.00000 atm
elementType: 8 7 6 6 6 1 1 1 1 1
symmnumber: 1
zpe: 198657.9 jmol-1
zpe.correction: 0.075665 hartree
zpe.thermalcorrener: 0.081257 hartree
zpe.thermalcorrenthalpy: 0.082201 hartree
zpe.thermalcorrgfe: 0.047459 hartree
zpe.sumelectzpe: -246.821793 hartree
zpe.sumelectthermal: -246.816201 hartree
zpe.sumelectthermalent: -246.815257 hartree
zpe.sumelectthermalfe: -246.849999 hartree
dipole: 0.4332 0.0345 0.0011
dipole: 0.4346
quadrupole: -21.9527 -29.0219 -32.6055
quadrupole: 2.4047 -0.0035 -0.0012
quadrupole: 5.9074 -1.1619 -4.7455 2.4047 -0.0035 -0.0012
hfenergy: -246.8974579 hartree
pointgroup: C01 [X(C3H5N1O1)]
dipole: 0.1701989 0.016264 0.0004333 debye
dipolederiv: -1.3012166 0.1057367 -0.0000766 0.812763 -0.1375498 -0.0002519 -0.000189 -0.000256 -0.403004 0.8442004 -0.0193807 -0.0001529 -0.6028656 -0.119494 0.0000397 -0.0002548 0.0000269 -0.185823 0.1816493 0.008087 0.0000398 -0.0971357 0.1171965 -0.000104 0.0000801 -0.0000895 -0.1369973 -0.0068439 -0.0029092 0.0000998 -0.1890382 0.1464794 -0.0000196 0.0003904 0.0000182 -0.0276129 -0.1952481 -0.0820989 0.0000931 -0.052739 0.0946534 -0.0001974 -0.000073 -0.0002295 -0.414073 0.0671653 -0.0252111 -0.0000049 0.0510472 -0.0801269 0.0000914 -0.0000438 0.0000845 0.1721522 0.0348474 -0.013169 -0.0000121 0.02691 -0.0936922 0.0000748 -0.0000343 0.0000501 0.2012006 -0.058553 0.0699658 -0.0000568 0.0720675 0.0444468 0.0000721 -0.0000199 0.0000716 0.1924914 0.0808512 0.0374971 -0.0000308 0.0065882 -0.1108167 0.0001154 -0.0000128 0.0001273 0.2023488 0.353148 -0.0785177 0.0001014 -0.0275973 0.1389036 0.0001794 0.000157 0.0001962 0.3993173 unknown
polarizability: 92.9852501|8.6080945|37.770897|-0.0011369|-0.0074493|17.4864061 unknown
InChI: InChI=1S/C3H5NO/c1-2-3-4-5/h2-3,5H,1H2
charge 0 multiplicity 1
10 atoms
O  -2.365064 0.331524 -0.000045
N  -1.165376 -0.504569 -0.000048
C  1.224366 -0.368756 0.000153
C  -0.090303 0.262626 -0.000376
C  2.391908 0.338684 0.000103
H  1.236179 -1.466205 0.000535
H  -0.166606 1.362301 -0.000587
H  3.363546 -0.164937 0.000404
H  2.401283 1.435531 -0.0003
H  -3.097133 -0.337798 0.000662
