program: Gaussian 09
title: 000145816
version: EM64L-G09RevD.01
frameworkgroup: C1[X(C9H13N5O2S)]
method: RPBEPBE
basis: SDD
operation: Freq
keyword: #p
keyword: freq=noraman
keyword: PBEPBE/SDD
title: #p freq=noraman PBEPBE/SDD
converged: YES YES NO NO
title: Mulliken charges:
elementType: S O O N N N N N C C C C C C C C C H H H H H H H H H H H H H
charge: 0.148817 -0.340545 -0.506012 -0.151521 -0.093578 -0.375272 -0.046410 -0.617190 -0.359689 0.098184 -0.682510 0.082875 -0.208534 0.087533 0.166687 -0.629339 -0.244416 0.238166 0.280242 0.318702 0.260591 0.270752 0.326858 0.271083 0.234951 0.199091 0.199794 0.317463 0.359857 0.393371
chargesum: 0.00000
title: Mulliken charges with hydrogens summed into heavy atoms:
elementType: S O O N N N N N C C C C C C C C C
charge: 0.148817 -0.340545 -0.112641 -0.151521 -0.093578 -0.048414 -0.046410 0.060130 0.158719 0.098184 -0.103217 0.082875 0.062218 0.087533 0.166687 -0.123306 0.154468
polarizability: 2.27546151e+02 -1.37318524e+00 1.69141357e+02 1.47408739e+01 -4.74632454e+00 8.64902943e+01
1716.lowfreq: -4.6202 -0.0024 -0.0019 -0.0007 7.5828 10.7938 36.4241 37.4162 61.9643
frequency: 36.2277 37.3469 61.9424 88.7392 110.8566 142.8142 169.0225 188.1559 206.2203 213.6886 225.2300 252.2166 269.7147 287.5224 299.6218 336.5358 370.9884 382.5525 450.5664 485.0464 504.8980 525.0473 586.6967 595.9641 608.0904 619.5103 646.3187 653.2543 670.2599 673.0500 697.0663 738.1507 766.1860 768.1063 813.0923 813.5095 839.4600 950.1235 958.8103 985.4945 1002.2346 1013.7540 1034.1330 1048.5352 1073.0120 1142.3969 1165.5809 1173.6101 1184.8246 1229.1538 1249.5559 1254.6477 1273.7531 1292.2384 1293.8483 1323.1496 1336.1875 1352.0778 1373.4331 1409.7426 1417.4040 1417.9694 1423.0958 1431.3131 1468.9416 1471.4284 1501.2537 1517.7193 1584.2339 1598.7490 1633.9090 2922.5895 2989.4473 3022.7776 3024.7672 3030.6294 3097.8306 3108.8493 3126.7794 3211.6837 3242.5753 3542.6605 3554.9047 3705.7511
redmass: 5.1791 5.7484 6.4864 3.5873 5.2321 5.7946 4.0190 5.4443 5.1507 3.4614 4.4347 3.3628 1.4573 2.4990 3.3185 4.0265 5.8557 4.6649 2.3704 6.9452 7.3177 1.1354 1.1979 4.5286 6.1365 3.9691 2.7051 1.4262 8.1745 7.2138 9.0407 2.3075 1.6671 5.5387 3.0491 2.2433 2.1883 2.0860 5.5332 1.6297 1.9360 2.1651 3.6590 3.5287 4.4308 1.9649 1.1969 1.5670 2.5973 1.1715 1.4042 1.7521 1.5949 1.2344 3.4673 1.6163 1.1331 2.0464 2.1004 1.3551 1.1388 5.4332 2.1904 1.1223 1.0857 1.2450 6.3463 4.3429 2.7894 3.3497 2.1879 1.0610 1.0990 1.0600 1.0599 1.0643 1.1055 1.0999 1.1061 1.0723 1.0988 1.0759 1.0478 1.1054
irintensity: 1.2125 5.2928 2.7185 4.5234 5.6534 3.9245 6.8345 13.2248 0.7945 10.2348 2.2695 7.1031 21.0187 27.5801 13.8958 8.8421 4.7062 5.4747 17.7380 7.4654 2.2401 310.2883 71.8267 5.1036 7.6516 14.5924 43.1621 188.8088 4.7498 1.3049 14.4391 18.3992 5.1938 2.3999 10.5575 15.8401 14.0805 18.3823 34.0864 11.4737 37.4049 9.1326 2.6130 73.2856 2.8915 1.5508 9.5258 31.6416 43.0031 2.8950 0.6568 29.9656 27.6811 5.0108 49.8282 71.6929 120.2227 54.7255 76.1671 17.7614 10.4910 46.8055 55.3666 20.0909 10.2463 46.0435 134.9431 233.6327 222.0557 322.9663 676.8381 128.6065 33.4071 49.5676 25.9599 23.4717 14.3490 0.0441 0.1643 925.2126 1.2217 50.4914 136.2187 47.8499
temp: 298.150 k
press: 1.00000 atm
elementType: 16 8 8 7 7 7 7 7 6 6 6 6 6 6 6 6 6 1 1 1 1 1 1 1 1 1 1 1 1 1
symmnumber: 1
zpe: 605915.9 jmol-1
zpe.correction: 0.230781 hartree
zpe.thermalcorrener: 0.247150 hartree
zpe.thermalcorrenthalpy: 0.248094 hartree
zpe.thermalcorrgfe: 0.186306 hartree
zpe.sumelectzpe: -1171.763397 hartree
zpe.sumelectthermal: -1171.747028 hartree
zpe.sumelectthermalent: -1171.746084 hartree
zpe.sumelectthermalfe: -1171.807872 hartree
dipole: -5.7137 1.8971 -0.3477
dipole: 6.0304
quadrupole: -70.0834 -113.8792 -111.0907
quadrupole: 2.2065 6.9517 1.6689
quadrupole: 28.2677 -15.5281 -12.7396 2.2065 6.9517 1.6689
hfenergy: -1171.994178 hartree
pointgroup: C01 [X(C9H13N5O2S1)]
dipole: 2.3661336 0.1729072 0.0230272 debye
polarizability: 225.6336892|-11.3023089|170.9588382|11.6326142|-9.7318552|86.5852748 unknown
InChI: InChI=1S/C9H13N5O2S/c10-9-12-7-6(8(16)13-9)14(5-11-7)1-3-17-4-2-15/h5,12,15H,1-4,10H2
charge 0 multiplicity 1
30 atoms
S  -4.108192 1.905356 -0.100402
O  -0.666601 -1.71321 -0.426539
O  -2.803864 -1.046212 1.047132
N  0.028243 1.374305 -0.428047
N  2.160833 2.083678 0.028492
N  3.126229 -0.181099 0.341873
N  1.607611 -2.039018 0.045764
N  3.852723 -2.430376 0.54358
C  -1.418287 1.432497 -0.766356
C  0.7930 0.215921 -0.189674
C  -2.286911 1.887673 0.425304
C  2.085713 0.704656 0.079537
C  0.886448 2.452228 -0.282871
C  0.493621 -1.214539 -0.205633
C  2.823683 -1.545561 0.301169
C  -4.7800 0.327756 0.718554
C  -4.073384 -0.976533 0.33494
H  -1.547726 2.118245 -1.622837
H  -1.717209 0.421923 -1.082106
H  -2.195742 1.181536 1.264263
H  -2.03846 2.91377 0.745521
H  0.564747 3.481859 -0.418313
H  4.058842 0.185285 0.542069
H  -4.736858 0.462589 1.812264
H  -5.838063 0.31244 0.399357
H  -3.941789 -1.031814 -0.766345
H  -4.723525 -1.825872 0.643678
H  4.806477 -2.144927 0.747358
H  3.610699 -3.418313 0.519655
H  -2.06766 -1.427041 0.473312
