program: Gaussian 09
title: 000145787
version: EM64L-G09RevD.01
frameworkgroup: C1[X(C10H8N2O)]
method: RPBEPBE
basis: SDD
operation: Freq
keyword: #p
keyword: freq=noraman
keyword: PBEPBE/SDD
title: #p freq=noraman PBEPBE/SDD
converged: YES YES NO NO
title: Mulliken charges:
elementType: O N N C C C C C C C C C C H H H H H H H H
charge: -0.265769 -0.080067 -0.615112 0.413189 -0.059166 -0.305700 -0.385006 0.026576 -0.321031 -0.281914 -0.243125 -0.219701 0.153660 0.248082 0.238260 0.260318 0.283284 0.233878 0.235577 0.353450 0.330318
chargesum: 0.00000
title: Mulliken charges with hydrogens summed into heavy atoms:
elementType: O N N C C C C C C C C C C
charge: -0.265769 -0.080067 0.068656 0.413189 -0.059166 -0.057618 -0.146746 0.026576 -0.060712 0.001370 -0.009247 0.015875 0.153660
polarizability: 1.99000193e+02 -9.30918679e+00 1.32405307e+02 8.43951923e-04 1.02333698e-03 4.79209728e+01
1716.lowfreq: -9.3013 -0.0004 -0.0002 0.0006 4.9722 10.7926 76.9064 90.2330 160.6497
frequency: 76.8978 90.2285 160.6497 183.9100 247.3888 322.3388 348.5886 398.2901 475.5905 485.1167 491.1826 518.7277 563.0575 571.2314 614.9574 644.9984 671.0437 694.2010 738.4068 756.1773 779.0844 805.4714 865.4028 867.7240 894.6166 936.0265 969.4209 998.4448 1007.5137 1017.3293 1064.5982 1102.8130 1139.7818 1163.0246 1170.7193 1236.4643 1256.6653 1296.2561 1359.2937 1364.9138 1407.1035 1423.9321 1459.3283 1506.7977 1550.6013 1553.2345 1591.4750 1624.6654 1635.8389 3125.4589 3135.8948 3139.6510 3156.6353 3170.9188 3180.0917 3483.8742 3668.2001
redmass: 6.7335 5.0371 5.0472 4.2679 4.8244 6.6107 4.5182 3.5045 2.9868 3.5972 2.9483 6.6388 6.8608 1.4883 7.1842 3.0633 4.7133 1.0806 2.0502 5.6478 1.7935 3.2215 1.5505 5.7925 1.7004 4.8592 1.3685 1.3321 1.3495 2.2028 2.0616 1.8343 1.2257 1.8557 1.2721 2.0081 1.8335 2.7450 3.1569 3.8728 5.8344 2.2663 3.1964 3.7550 2.1792 2.4453 6.4932 6.5036 5.8981 1.0873 1.0907 1.0890 1.0947 1.1002 1.0960 1.0470 1.1019
irintensity: 6.9316 1.5244 11.9056 5.8566 0.6336 0.0233 21.2881 0.0020 30.2922 1.8547 0.0307 0.1635 6.7890 117.3770 4.9158 49.9033 3.4700 97.7563 0.6301 3.3946 96.5503 2.9260 44.4434 1.6553 14.1816 1.8054 6.1979 0.0876 0.0143 5.3703 2.0298 10.4348 1.9352 31.7639 4.4063 14.6293 4.0834 1.6785 64.3655 75.6560 6.0333 10.7705 18.2637 21.4376 131.4208 84.9220 4.9993 1.6341 258.5855 2.3284 7.6925 10.8560 21.1683 22.9841 3.5712 34.2542 80.3445
temp: 298.150 k
press: 1.00000 atm
elementType: 8 7 7 6 6 6 6 6 6 6 6 6 6 1 1 1 1 1 1 1 1
symmnumber: 1
zpe: 419663.4 jmol-1
zpe.correction: 0.159841 hartree
zpe.thermalcorrener: 0.169718 hartree
zpe.thermalcorrenthalpy: 0.170662 hartree
zpe.thermalcorrgfe: 0.124293 hartree
zpe.sumelectzpe: -569.727828 hartree
zpe.sumelectthermal: -569.717952 hartree
zpe.sumelectthermalent: -569.717008 hartree
zpe.sumelectthermalfe: -569.763377 hartree
dipole: 4.0512 -1.2934 -0.0001
dipole: 4.2527
quadrupole: -75.4566 -62.3302 -79.3682
quadrupole: 10.6273 0.0007 -0.0031
quadrupole: -3.0716 10.0548 -6.9832 10.6273 0.0007 -0.0031
hfenergy: -569.8876696 hartree
pointgroup: C01 [X(C10H8N2O1)]
dipole: 1.6023477 -0.4814777 -0.0007328 debye
dipolederiv: -1.0005808 0.2966429 0.0001405 0.0311561 -0.7557663 0.0000487 0.0004365 -0.0006803 -0.3659939 -0.3006463 0.0522669 0.0000511 -0.0527119 -0.3963283 -0.0000362 -0.0002482 -0.0000868 -0.228539 -0.584173 -0.248727 -0.0004575 -0.2707436 -1.0786958 -0.0002255 -0.0004447 0.0000936 -0.6667031 0.0017148 -0.1089434 -0.0000287 0.18808 -0.2084171 -0.0001783 0.0000924 -0.0000954 0.0771346 0.1122917 -0.058296 -0.0000237 -0.3214009 0.0495562 0.0000594 -0.0001733 -0.000018 0.0676056 0.1759742 0.1082416 -0.0000381 -0.0412387 0.2231975 0.0001767 -0.0000789 0.0001565 -0.1372475 -0.0265103 0.0712598 0.0000003 0.1104926 0.1022808 0.0000945 0.0000137 0.0001025 -0.168004 -0.1120591 -0.0421523 0.0001215 0.2508831 0.2393902 -0.0000072 0.0001539 0.0000034 0.0769448 -0.063382 0.0657367 0.0000137 0.0005353 0.0910581 0.0001291 0.0000065 0.0001074 -0.1626176 -0.2721087 -0.1638238 0.0000132 -0.2166081 -0.1201117 0.0000298 -0.0002326 -0.0000057 -0.0916567 0.0925078 0.0916035 -0.0000067 0.1306275 -0.0250518 0.0000231 0.0000038 0.0000362 -0.1464183 -0.0630745 -0.1176896 -0.0000652 -0.1613085 0.0939572 0.0001482 -0.0000869 0.0001372 -0.1506643 1.3716265 -0.0427685 -0.0002734 0.2415904 1.3955165 0.0001432 -0.0001146 0.0006292 0.1948814 0.0591177 -0.0842418 -0.0000112 -0.0300944 -0.0694853 -0.0000843 0.000044 -0.0000825 0.1432149 0.0522179 -0.015037 0.0000168 -0.0909291 -0.089212 -0.0000902 -0.000025 -0.0001076 0.1591718 0.0816405 -0.0754655 -0.0000184 -0.0119114 -0.0430889 -0.0000904 0.000009 -0.0000728 0.1613769 0.0956811 0.0906419 0.0000364 0.0554663 0.0757992 -0.0000436 0.0000238 -0.0000641 0.1643289 -0.1212838 -0.0425829 0.0000438 -0.0416829 0.0835932 -0.000026 0.0000485 -0.0000247 0.1615085 -0.0188999 0.1050916 0.0000866 0.110301 -0.021456 -0.0001063 0.0000852 -0.0001084 0.160659 0.3482344 0.0928145 0.0002064 0.1048817 0.2426007 0.0000192 0.0002524 0.0000525 0.3642318 0.1717118 0.0254286 0.0001927 0.0146155 0.2106634 0.0000161 0.0002343 0.0000277 0.3867864 unknown
polarizability: 199.2995017|-8.1631919|132.1059685|-0.0489533|0.0363319|47.9210021 unknown
InChI: InChI=1S/C10H8N2O/c11-10(13)9-6-5-7-3-1-2-4-8(7)12-9/h1-6H,11H2
charge 0 multiplicity 1
21 atoms
O  -3.883459 0.590824 0.002172
N  -0.57941 -0.878201 -0.000123
N  -3.158974 -1.637935 0.000854
C  1.200453 0.848883 0.000241
C  0.763789 -0.534696 -0.00027
C  0.191502 1.868284 0.000918
C  2.603355 1.135497 0.000073
C  -1.492758 0.117484 0.000443
C  1.742256 -1.579891 -0.000952
C  -1.15472 1.508189 0.001048
C  3.537513 0.096967 -0.000591
C  3.103809 -1.268484 -0.001105
C  -2.957243 -0.27858 0.000512
H  0.491441 2.922537 0.001312
H  2.933674 2.181202 0.000476
H  1.386309 -2.614794 -0.001337
H  -1.970469 2.2357 0.001508
H  4.609595 0.321319 -0.000724
H  3.850038 -2.07028 -0.001619
H  -2.333998 -2.24319 -0.00002
H  -4.105901 -2.010335 0.001885
