program: Gaussian 09
title: 000145785
version: EM64L-G09RevD.01
frameworkgroup: C1[X(C8H12N2)]
method: RPBEPBE
basis: SDD
operation: Freq
keyword: #pfreq=noraman
keyword: PBEPBE/SDD
title: #p freq=noraman PBEPBE/SDD
converged: YES YES NO NO
title: Mulliken charges:
elementType: N N C C C C C C C C H H H H H H H H H H H H
charge: -0.715937 -0.715952 0.169009 0.169003 0.349481 0.349509 -0.443722 -0.443732 -0.846853 -0.846853 0.206102 0.206101 0.224915 0.223222 0.225516 0.223233 0.225503 0.224915 0.294364 0.313901 0.313908 0.294367
chargesum: 0.00000
title: Mulliken charges with hydrogens summed into heavy atoms:
elementType: N N C C C C C C C C
charge: -0.107671 -0.107678 0.169009 0.169003 0.349481 0.349509 -0.237620 -0.237631 -0.173200 -0.173203
polarizability: 1.38541558e+02 6.10034493e-05 1.13985195e+02 2.13733188e-02 8.10703702e-04 5.27160331e+01
1716.lowfreq: -17.8356 -14.5304 -0.0005 0.0004 0.0007 8.8673 50.2839 90.2553 133.3275
frequency: 49.8958 90.1713 133.3260 134.3835 172.5366 173.9545 246.3956 294.2303 316.3868 319.9807 328.0159 363.3028 384.0372 467.3200 474.1333 481.5719 517.4427 594.7780 632.0221 734.7167 743.9199 790.6280 850.1276 900.9332 923.3676 998.5533 1025.5421 1030.2127 1039.7008 1097.7359 1103.3083 1175.5793 1222.2594 1290.2651 1339.6333 1377.2954 1383.3696 1405.3571 1454.3665 1465.7104 1473.5416 1484.0828 1495.7143 1506.0791 1594.4430 1626.2428 1632.7512 1646.9842 2946.0710 2948.2325 3006.9315 3007.8863 3104.6944 3105.8749 3113.8741 3130.9688 3581.1027 3582.6032 3722.8561 3722.9382
redmass: 1.2447 1.0515 5.2327 2.1422 1.1279 1.1282 1.8846 1.1507 1.4618 2.0681 2.9867 3.3162 2.6686 6.2547 3.7326 3.3074 2.8168 3.0605 4.1483 4.0105 5.2614 1.5511 2.4095 1.3752 1.8990 1.4151 1.4254 1.3263 1.5587 2.2032 1.8310 1.3830 3.2639 1.8007 5.6440 4.2946 1.2792 1.3639 2.5802 1.2561 1.0467 1.0454 2.4292 1.3517 6.9670 1.4785 1.1570 2.8301 1.0422 1.0428 1.0974 1.0972 1.0864 1.0924 1.0880 1.0968 1.0445 1.0451 1.1034 1.1034
irintensity: 0.1103 330.2768 67.9917 0.0851 0.0047 49.4809 139.4286 0.2186 20.8853 5.5823 7.2913 0.1060 0.0813 0.9903 2.6288 0.0106 0.0256 4.3802 2.2760 0.0004 10.6982 60.0280 0.0043 0.0008 0.4612 6.6291 5.5512 7.2459 0.0067 56.1442 20.9299 4.9133 0.7824 74.3854 3.6534 22.1785 7.2992 11.7524 13.2491 33.1645 0.0130 19.6382 247.2023 9.0150 0.8276 0.3803 305.3307 9.9889 52.0714 50.5311 0.0400 60.9925 14.8635 18.9920 37.1682 33.5069 83.1774 0.2510 0.3011 34.6951
temp: 298.150 k
press: 1.00000 atm
elementType: 7 7 6 6 6 6 6 6 6 6 1 1 1 1 1 1 1 1 1 1 1 1
symmnumber: 1
zpe: 484250.4 jmol-1
zpe.correction: 0.184441 hartree
zpe.thermalcorrener: 0.196188 hartree
zpe.thermalcorrenthalpy: 0.197132 hartree
zpe.thermalcorrgfe: 0.147666 hartree
zpe.sumelectzpe: -420.809671 hartree
zpe.sumelectthermal: -420.797925 hartree
zpe.sumelectthermalent: -420.796980 hartree
zpe.sumelectthermalfe: -420.846446 hartree
dipole: -0.0001 0.4318 0.0011
dipole: 0.4318
quadrupole: -43.0578 -53.6419 -66.9215
quadrupole: -0.0001 0.6492 -0.0001
quadrupole: 11.4826 0.8984 -12.3811 -0.0001 0.6492 -0.0001
hfenergy: -420.9941125 hartree
pointgroup: C01[X(C8H12N2)]
dipole: 0.0000574 -0.1698649 0.000446 debye
dipolederiv: -1.4959491 0.0811781 0.0145652 0.0304461 -0.1265859 -0.0094954 -0.0148682 -0.0088484 -0.7495723 -1.4959343 -0.0812945 0.0147255 -0.0305792 -0.1265907 0.0092918 -0.0143368 0.0086842 -0.7496381 -0.066579 -0.1689761 -0.0006549 0.3807784 0.186647 -0.0122889 -0.0024709 0.0058963 -0.0918414 -0.0665736 0.1689509 -0.0006555 -0.3808063 0.1866266 0.0122558 -0.0024066 -0.0059438 -0.0918467 1.3752814 -0.0713395 -0.0426838 -0.0564532 -0.3140135 0.0047317 -0.0435865 0.0053458 0.0692176 1.3752963 0.0714742 -0.0427555 0.0565855 -0.3140018 -0.0046541 -0.0436353 -0.0052828 0.0692395 -0.1414519 0.327645 -0.0028933 -0.2926862 0.1346979 0.0109274 0.0015287 -0.0136918 -0.2187805 -0.1414604 -0.3276652 -0.0028475 0.2926733 0.1346958 -0.0109613 0.0014311 0.013639 -0.2187843 -0.0276269 -0.0556704 0.0025233 -0.0852841 -0.0072182 0.0020101 -0.0000638 0.0008537 0.1150529 -0.0276324 0.0556687 0.0025442 0.0852825 -0.0072048 -0.0020125 -0.0000228 -0.0008325 0.1150513 -0.0092851 0.1261476 0.006668 0.1039968 -0.0930446 -0.0048174 0.0065564 -0.0054592 0.1630177 -0.0092675 -0.1261403 0.0066794 -0.10399 -0.093063 0.0048356 0.0065572 0.0054842 0.1630178 0.057197 0.1614899 0.0043155 0.0666209 -0.0994192 -0.0048733 0.0038545 -0.0084134 0.0970312 -0.0328013 -0.092729 0.1199517 -0.0201068 0.0447518 -0.0196931 0.1278287 0.0499871 -0.0723302 -0.0507461 -0.0932332 -0.1205063 -0.0148088 0.048683 0.0243003 -0.1260205 -0.0392234 -0.0484584 -0.0328318 0.0927192 0.1199454 0.0200883 0.0447898 0.0197182 0.1278176 -0.0499557 -0.0722722 -0.0507401 0.0932338 -0.1205169 0.0148151 0.04866 -0.0242965 -0.1260457 0.0392329 -0.0485156 0.0572137 -0.1614796 0.0042875 -0.0666093 -0.0994368 0.0048557 0.0038342 0.0083818 0.0970334 0.1940149 -0.0140999 0.0100005 -0.0031692 0.0973132 -0.0003193 0.0195536 -0.004653 0.377874 0.1979429 -0.0277078 0.0086945 -0.0142569 0.1281963 0.0077817 0.0276897 0.0111534 0.3587892 0.1979297 0.0277223 0.0086575 0.0142745 0.1281963 -0.0076535 0.0274104 -0.0109846 0.3588226 0.1940035 0.014106 0.0099555 0.0031884 0.0973208 0.0003568 0.0193952 0.0046304 0.3778926 unknown
polarizability: 138.4259406|0.0008345|113.9851952|-3.1480168|-0.0038097|52.8316507 unknown
InChI: InChI=1S/C8H12N2/c1-5-6(2)8(10)4-3-7(5)9/h3-4H,9-10H2,1-2H3
charge 0 multiplicity 1
22 atoms
N  -2.83241 0.51953 0.100637
N  2.83231 0.519748 -0.100836
C  -0.712131 -0.744063 0.024832
C  0.712137 -0.744009 -0.02488
C  -1.423814 0.499952 0.05262
C  1.423719 0.500061 -0.052779
C  -0.702591 1.719931 0.026851
C  0.702397 1.719984 -0.027149
C  -1.548884 -2.014432 0.04973
C  1.548992 -2.014312 -0.049681
H  -1.246066 2.673121 0.047861
H  1.245796 2.673216 -0.048255
H  -0.947157 -2.934008 0.012713
H  -2.16556 -2.07134 0.971028
H  -2.244731 -2.050752 -0.814009
H  2.165834 -2.071117 -0.970871
H  2.244689 -2.050633 0.814182
H  0.94733 -2.933938 -0.012816
H  -3.326363 1.405479 0.130997
H  -3.373356 -0.335445 0.156805
H  3.373354 -0.335204 -0.156407
H  3.326205 1.40573 -0.131174
