program: Gaussian 09
title: 000145797
version: EM64L-G09RevD.01
frameworkgroup: C1[X(C16H21N3O3)]
method: RPBEPBE
basis: SDD
operation: Freq
keyword: #p
keyword: freq=noraman
keyword: PBEPBE/SDD
title: #p freq=noraman PBEPBE/SDD
converged: YES YES NO NO
title: Mulliken charges:
elementType: O O O N N N C C C C C C C C C C C C C C C C H H H H H H H H H H H H H H H H H H H H H
charge: -0.312336 -0.491183 -0.262512 -0.188495 -0.413437 -0.620669 -0.072514 -0.075793 -0.537041 -0.405144 -0.438842 -0.431620 0.141460 -0.526716 0.136562 0.224708 -0.053158 -0.366216 0.228552 0.386873 -0.459487 -0.870146 0.237697 0.261788 0.228765 0.230546 0.223551 0.260682 0.254178 0.206933 0.233778 0.209632 0.344228 0.226582 0.239642 0.273426 0.229898 0.253760 0.228187 0.233187 0.334875 0.315931 0.379889
chargesum: 0.00000
title: Mulliken charges with hydrogens summed into heavy atoms:
elementType: O O O N N N C C C C C C C C C C C C C C C C
charge: -0.312336 -0.111295 -0.262512 -0.188495 -0.069209 0.030137 0.165183 0.185995 -0.077730 0.079089 0.022269 0.011790 0.141460 -0.060493 0.136562 0.224708 -0.053158 -0.092790 0.228552 0.386873 -0.229589 -0.155012
polarizability: 2.97752390e+02 -5.41353064e+00 2.09243097e+02 -9.27015694e-01 1.83157674e+00 1.17344078e+02
1716.lowfreq: -7.5646 -0.0006 -0.0005 0.0009 2.6539 5.9936 23.5839 29.4969 36.6380
frequency: 23.5671 29.4474 36.6296 54.7898 65.1848 85.3920 106.0588 124.4470 128.3376 132.4568 166.8113 174.7997 209.2765 209.8521 234.2916 261.5995 292.5909 302.0878 304.1405 313.4320 344.8522 378.2462 412.6893 434.3542 440.8264 450.9058 489.1028 503.3650 525.6467 530.2122 537.3740 558.9269 571.8607 581.1318 593.5216 596.6104 638.3163 670.0718 698.4585 717.3473 752.0424 775.3482 781.2767 814.1876 835.8067 850.9902 859.2383 874.7217 904.2450 930.5928 952.4313 966.2996 969.7528 987.7300 1038.4391 1039.0069 1044.0015 1048.6696 1067.5119 1093.2237 1105.1720 1113.5078 1129.6768 1148.8213 1164.9464 1168.7947 1173.9185 1184.6752 1212.0911 1233.2424 1243.2084 1250.9597 1254.6079 1268.4608 1276.5745 1287.5067 1295.7469 1300.7872 1318.5423 1326.5095 1335.4736 1353.1314 1360.9773 1372.4708 1376.5915 1393.5964 1414.0261 1443.3148 1445.2049 1462.6094 1468.2159 1470.5942 1475.0466 1479.1182 1490.6682 1496.5653 1521.5892 1537.3483 1577.1764 1596.5781 1636.9717 1643.8273 2942.0595 2951.3571 2952.2460 2968.3201 2971.1248 2984.9679 2992.1199 3006.3390 3019.0300 3026.6333 3036.5895 3057.1862 3063.6635 3069.9562 3088.8624 3137.5236 3170.0448 3515.6216 3541.7687 3612.7058 3672.3283
redmass: 5.5551 5.6894 5.3721 3.2797 4.0889 3.4977 4.1222 3.0027 1.2313 2.6885 4.1706 2.3969 4.1850 3.5484 1.2595 3.2958 4.9598 3.7825 3.6233 4.3204 3.9736 7.9139 2.1977 3.5400 3.0110 2.9701 4.9566 1.4631 1.9808 2.1253 1.6107 2.7456 3.3587 4.0019 4.3478 2.8882 2.4032 2.1717 6.8505 4.9050 4.1297 2.0103 2.6308 1.5037 2.4111 4.0237 2.2426 3.0947 2.8921 1.7862 1.8812 1.3628 1.8081 1.9817 2.5011 1.5932 2.3714 1.9261 2.0144 2.6078 1.8527 2.8607 2.1461 1.6317 1.3965 2.2015 1.5662 3.1150 1.7942 1.3871 1.4553 1.9053 1.2634 1.5387 1.3164 1.7399 1.5174 1.6202 1.3041 1.4325 1.6647 1.6261 1.7037 2.4080 2.4565 1.5811 2.5159 2.5540 1.0941 1.4441 1.1840 1.2277 1.0879 1.0477 1.1148 1.7883 3.9943 2.6544 6.6294 1.4339 6.3789 3.5622 1.0674 1.0409 1.0708 1.0753 1.0640 1.0645 1.0739 1.0734 1.0978 1.0976 1.0957 1.1015 1.0950 1.1011 1.0941 1.0891 1.0948 1.0447 1.0764 1.0659 1.1043
irintensity: 0.9122 11.9782 5.8728 2.5463 2.8175 2.9044 0.9604 0.1639 0.8581 1.7660 2.8375 10.3665 3.5615 4.1616 118.6381 0.9669 3.0189 2.2137 19.5130 13.5528 4.1235 7.9887 2.4379 1.7634 1.8302 3.8754 4.3940 48.1738 115.3325 3.6243 95.9072 35.3936 25.9609 3.8391 3.7664 25.0243 27.2989 31.1841 11.6850 7.3639 28.1178 16.0120 12.2264 21.0683 21.9443 10.0292 2.7969 10.2171 3.0348 11.3394 10.4393 1.4483 0.0173 5.3908 2.7315 6.1727 10.1364 5.9293 14.6982 4.9396 1.3133 26.5112 112.7609 68.0713 31.4850 43.1855 1.2900 40.1696 11.7707 18.1623 10.0034 0.8467 0.1443 3.3090 22.9050 30.0065 9.2481 14.3793 2.0515 51.0219 19.1233 184.0215 27.4769 258.3205 13.2719 37.3979 49.8103 1.1631 14.0220 16.4331 9.7046 8.4378 27.9229 15.4789 2.3552 25.9933 73.0620 291.4446 65.8469 72.9758 102.2954 284.3391 75.1956 58.8667 31.0207 17.5251 10.2841 29.9787 19.6452 49.3948 24.5116 6.8258 37.7724 19.5602 13.7103 49.0509 12.3116 10.8084 8.8410 30.3723 75.4113 39.5652 22.2112
temp: 298.150 k
press: 1.00000 atm
elementType: 8 8 8 7 7 7 6 6 6 6 6 6 6 6 6 6 6 6 6 6 6 6 1 1 1 1 1 1 1 1 1 1 1 1 1 1 1 1 1 1 1 1 1
symmnumber: 1
zpe: 927726.9 jmol-1
zpe.correction: 0.353353 hartree
zpe.thermalcorrener: 0.374626 hartree
zpe.thermalcorrenthalpy: 0.375570 hartree
zpe.thermalcorrgfe: 0.302031 hartree
zpe.sumelectzpe: -1010.627323 hartree
zpe.sumelectthermal: -1010.606049 hartree
zpe.sumelectthermalent: -1010.605105 hartree
zpe.sumelectthermalfe: -1010.678644 hartree
dipole: -1.7658 -1.6716 -0.2718
dipole: 2.4466
quadrupole: -106.1924 -130.8528 -131.8820
quadrupole: 30.9961 -5.7901 2.1049
quadrupole: 16.7833 -7.8770 -8.9063 30.9961 -5.7901 2.1049
hfenergy: -1010.9806753 hartree
pointgroup: C01 [X(C16H21N3O3)]
dipole: -0.6950866 0.6609806 0.0808089 debye
polarizability: 297.6296218|5.1658243|209.2467085|5.3049736|0.7027232|117.4632357 unknown
InChI: InChI=1S/C16H21N3O3/c1-9-2-4-12-14(15(9)21)18-7-11-6-10(3-5-13(17)20)8-19(11)16(12)22/h2,4,10-11,18,21H,3,5-8,17H2,1H3
charge 0 multiplicity 1
43 atoms
O  -0.306603 -2.384688 0.317709
O  -4.581274 1.959771 0.241813
O  6.895963 0.957087 0.043891
N  0.368104 -0.24584 -0.179954
N  -2.01293 1.734131 0.389081
N  7.101574 -1.304647 0.506061
C  2.53209 0.710364 0.11782
C  0.209218 1.172247 -0.585235
C  1.674908 1.651972 -0.771493
C  1.786992 -0.638919 -0.010934
C  4.016031 0.654003 -0.289522
C  -0.576861 1.9644 0.491386
C  -0.634543 -1.172891 0.058283
C  4.847176 -0.295701 0.601175
C  -2.086104 -0.77655 -0.019661
C  -2.663608 0.528248 0.143142
C  -4.095798 0.633157 0.064428
C  -2.96566 -1.881428 -0.231344
C  6.354912 -0.146543 0.349321
C  -4.951973 -0.455642 -0.160594
C  -4.355359 -1.738485 -0.307864
C  -6.456228 -0.258132 -0.233723
H  2.462037 1.051894 1.171616
H  -0.358377 1.243969 -1.533343
H  1.802877 2.717279 -0.511873
H  1.974705 1.527533 -1.82946
H  2.141748 -1.209549 -0.895482
H  1.883259 -1.302529 0.86433
H  4.472012 1.659933 -0.232367
H  4.095574 0.332067 -1.347545
H  -0.176245 1.691076 1.490992
H  -0.408742 3.047884 0.347576
H  -2.640611 2.534205 0.483563
H  4.529505 -1.347156 0.463897
H  4.666658 -0.04357 1.666841
H  -2.495181 -2.865251 -0.315642
H  -4.992784 -2.612048 -0.480652
H  -6.961976 -1.223157 -0.400031
H  -6.872969 0.162957 0.704574
H  -6.752839 0.409582 -1.068118
H  8.11366 -1.252153 0.389328
H  6.672327 -2.199601 0.733862
H  -5.567668 1.980319 0.215347
