program: Gaussian 09
title: 000145806
version: EM64L-G09RevD.01
frameworkgroup: C1[X(C14H12N4O5)]
method: RPBEPBE
basis: SDD
operation: Freq
keyword: #p
keyword: freq=noraman
keyword: PBEPBE/SDD
title: #p freq=noraman PBEPBE/SDD
converged: YES YES NO NO
title: Mulliken charges:
elementType: O O O O O N N N N C C C C C C C C C C C C C C H H H H H H H H H H H H
charge: -0.270733 -0.195103 -0.196252 -0.203864 -0.197485 -0.100272 -0.071660 0.020986 0.019197 0.391938 0.419983 0.239836 0.390274 -0.523563 0.237740 0.227816 -0.338769 -0.349183 -0.528399 -0.351556 -0.311452 -0.767764 -0.767471 0.341395 0.250384 0.297092 0.305454 0.245018 0.316140 0.218612 0.257294 0.261542 0.255896 0.258815 0.218114
chargesum: 0.00000
title: Mulliken charges with hydrogens summed into heavy atoms:
elementType: O O O O O N N N N C C C C C C C C C C C C C C
charge: -0.270733 -0.195103 -0.196252 -0.203864 -0.197485 -0.100272 -0.071660 0.020986 0.019197 0.391938 0.419983 0.239836 0.390274 -0.182168 0.237740 0.227816 -0.088385 -0.052091 -0.222945 -0.106539 0.004688 -0.030317 -0.034647
polarizability: 4.48569949e+02 -1.03640422e+01 2.27158831e+02 -2.31797771e-01 2.46543961e-01 8.34648970e+01
1716.lowfreq: -6.6370 -1.7662 -0.0004 0.0004 0.0005 4.1990 7.8090 10.0734 18.2473
frequency: -6.1593 9.7563 18.0699 36.0006 55.3336 72.0255 97.9046 134.4182 141.2820 159.7118 190.5410 207.5328 218.8075 224.6961 236.6846 292.8738 294.8490 315.8559 351.5233 374.0079 375.7649 378.3786 394.2059 433.9649 434.8164 453.6225 507.6165 516.3983 527.3897 555.8548 564.5571 630.4825 642.6525 663.3207 680.5799 693.7701 696.4773 722.2677 726.9637 755.5140 757.7986 765.6440 829.0631 847.2166 849.3789 873.0630 929.3414 948.4502 968.3998 992.9512 997.1236 1003.1875 1005.2073 1038.7738 1041.0684 1046.8817 1048.1354 1098.5654 1150.9200 1160.0359 1183.3450 1197.0806 1205.2806 1213.2144 1219.7063 1223.1901 1264.7485 1276.5502 1347.1245 1351.3607 1364.8279 1377.8612 1384.4891 1406.1047 1408.3082 1416.0052 1426.6288 1452.5911 1452.7452 1465.5468 1469.3941 1472.3667 1480.5753 1538.0086 1584.3591 1611.4946 1614.5754 2995.5106 2997.5894 3078.6029 3082.2911 3098.6218 3099.3351 3143.6145 3151.2202 3191.2534 3196.4129 3198.1342 3219.2762
redmass: 11.2944 11.6190 8.5415 4.6316 7.5730 9.0329 3.8764 4.2170 11.5889 5.7729 6.2712 3.1337 1.0708 1.2259 9.5468 5.1401 4.1406 5.7958 6.7631 4.7754 4.5792 5.3596 7.4775 3.4052 3.4834 8.3569 4.5965 5.6942 5.2973 5.0321 4.4575 6.7678 7.3635 8.1677 8.1592 3.6244 3.6456 5.8612 6.5257 11.0713 6.5213 5.0386 8.6832 1.3130 1.3062 7.2920 6.2429 1.4912 1.4297 1.3531 1.3527 1.4545 1.4632 1.5671 1.5723 2.1603 2.6270 5.2548 1.2988 1.3395 2.9132 5.0429 8.0034 3.6262 6.3857 5.7574 1.4111 1.6159 4.3215 4.5170 7.5303 4.4890 4.4029 1.3512 1.3676 5.5152 5.1199 1.0465 1.0462 1.1730 1.1776 2.7183 3.0792 6.6068 8.5407 7.2466 7.2282 1.0366 1.0367 1.0956 1.0957 1.1015 1.1016 1.0915 1.0910 1.0915 1.0918 1.0945 1.0939
irintensity: 0.0132 0.0144 3.7507 2.5616 3.0156 0.6477 0.1612 0.7748 0.1942 0.7536 0.1063 0.1261 0.4054 1.9072 3.3199 0.0868 0.2263 6.6902 3.3771 0.7439 7.0354 0.6798 2.0455 0.0163 0.9117 11.4645 4.3972 5.6974 17.7615 2.2871 24.5359 1.8335 5.1161 34.3710 4.0377 5.9980 0.5489 6.4615 3.5902 44.5187 2.0942 0.0820 5.5043 2.4389 46.1837 3.4857 2.8278 21.3357 30.2600 2.9797 1.7901 3.4231 3.8580 9.6609 10.8896 43.4975 47.4289 5.4195 16.3300 15.4110 213.1149 33.8300 397.7752 18.7288 16.9183 7.2741 19.8046 0.8180 46.7185 27.7337 166.5968 15.1807 77.2308 14.4268 14.2214 30.1853 6.0567 13.4536 14.0584 18.8919 16.2304 0.2396 127.8830 3.8964 8.7341 29.6834 56.1948 9.8510 8.3138 5.4456 4.7965 27.6832 25.1122 15.5656 9.3321 7.4030 13.0096 8.4587 4.9550
temp: 298.150 k
press: 1.00000 atm
elementType: 8 8 8 8 8 7 7 7 7 6 6 6 6 6 6 6 6 6 6 6 6 6 6 1 1 1 1 1 1 1 1 1 1 1 1
symmnumber: 1
zpe: 651947.0 jmol-1
zpe.correction: 0.248313 hartree
zpe.thermalcorrener: 0.267793 hartree
zpe.thermalcorrenthalpy: 0.268737 hartree
zpe.thermalcorrgfe: 0.197430 hartree
zpe.sumelectzpe: -1133.946284 hartree
zpe.sumelectthermal: -1133.926805 hartree
zpe.sumelectthermalent: -1133.925860 hartree
zpe.sumelectthermalfe: -1133.997167 hartree
dipole: 0.3315 0.8940 -0.0608
dipole: 0.9554
quadrupole: -161.0785 -133.9989 -131.7703
quadrupole: -44.4603 0.1575 -0.1831
quadrupole: -18.7959 8.2837 10.5123 -44.4603 0.1575 -0.1831
hfenergy: -1134.1945972 hartree
pointgroup: C01 [X(C14H12N4O5)]
dipole: -0.1192496 0.355245 0.0295424 debye
polarizability: 449.004152|3.3299484|226.6950149|0.213301|2.0759315|83.4945106 unknown
InChI: InChI=1S/C14H12N4O5/c1-9-3-5-11(7-13(9)17(20)21)15-16(19)12-6-4-10(2)14(8-12)18(22)23/h3-8H,1-2H3
charge 0 multiplicity 1
35 atoms
O  0.517119 -1.983596 0.18643
O  5.164825 -2.436645 0.267491
O  6.614069 -0.694792 0.091349
O  -4.54555 2.764805 0.313377
O  -6.350135 1.394014 0.152897
N  0.535221 -0.664229 0.210107
N  -0.499693 0.16025 0.222242
N  5.419327 -1.173818 0.191578
N  -5.076416 1.59032 0.2299
C  4.450585 1.18934 0.251538
C  1.853622 -0.008415 0.224775
C  4.266579 -0.226446 0.217239
C  -4.660988 -0.932389 0.19988
C  2.989987 -0.82974 0.207017
C  -4.165241 0.409506 0.218194
C  -1.823398 -0.336344 0.213223
C  3.258715 1.967109 0.273848
C  1.973475 1.399445 0.258373
C  -2.790334 0.703654 0.226038
C  -3.667535 -1.9489 0.190425
C  -2.284687 -1.69225 0.194761
C  5.782309 1.908557 0.272309
C  -6.118732 -1.337946 0.195178
H  2.890634 -1.916919 0.186712
H  3.355412 3.057251 0.304147
H  1.07379 2.017541 0.27262
H  -2.461613 1.74522 0.242604
H  -4.004064 -2.991346 0.178643
H  -1.566992 -2.511749 0.18547
H  5.62113 2.996607 0.351739
H  6.415116 1.576646 1.113224
H  6.370037 1.698727 -0.63801
H  -6.66275 -0.92143 1.060619
H  -6.645089 -0.952299 -0.695138
H  -6.202635 -2.437438 0.213699
