program: Gaussian 09
title: 000145887
version: EM64L-G09RevD.01
frameworkgroup: C1[X(C11H23NO7)]
method: RPBEPBE
basis: SDD
operation: Freq
keyword: #p
keyword: freq=noraman
keyword: PBEPBE/SDD
title: #p freq=noraman PBEPBE/SDD
converged: YES YES NO NO
title: Mulliken charges:
elementType: O O O O O O O N C C C C C C C C C C C H H H H H H H H H H H H H H H H H H H H H H H
charge: -0.522066 -0.444353 -0.509974 -0.478191 -0.446838 -0.397606 -0.231851 -0.476292 -0.218027 -0.105128 -0.078877 -0.398038 -0.156059 -0.060150 -0.132108 -0.331856 -0.719995 -0.704382 0.141052 0.230513 0.244757 0.234347 0.227154 0.250398 0.291168 0.209641 0.254001 0.310295 0.192814 0.212445 0.245539 0.213248 0.222965 0.228076 0.221538 0.226772 0.405779 0.354578 0.381938 0.374359 0.354889 0.383523
chargesum: 0.00000
title: Mulliken charges with hydrogens summed into heavy atoms:
elementType: O O O O O O O N C C C C C C C C C C C
charge: -0.116286 -0.089774 -0.128036 -0.103831 -0.091950 -0.014083 -0.231851 -0.165997 0.012485 0.139629 0.155470 0.079515 0.135109 0.149491 0.121893 0.073402 -0.038244 -0.027995 0.141052
polarizability: 1.85200730e+02 9.31537832e-01 1.47772968e+02 -1.93815203e+00 1.18522034e+00 1.23500265e+02
1716.lowfreq: -8.6331 -7.2006 -0.0013 -0.0010 -0.0005 9.4566 22.8370 30.6061 36.5011
frequency: 22.4137 30.5466 36.1056 50.0694 65.8532 74.1553 75.7197 93.2368 119.3625 129.6063 138.8732 177.3182 189.3938 191.7193 218.6948 247.7833 261.8341 277.3860 288.5197 309.1492 315.9816 324.5183 340.7369 361.7678 398.0625 421.4309 435.3278 458.9647 487.5310 493.0212 504.6687 513.5599 528.2115 562.2799 602.2956 613.3910 620.7863 679.6336 698.8209 732.0009 803.0410 808.9510 824.4377 855.0343 871.4741 899.9759 912.3685 919.9855 941.4204 953.3681 963.3010 972.1168 993.2788 1016.3200 1030.4735 1045.0947 1056.3036 1061.5796 1084.5944 1094.8983 1096.8574 1114.4994 1128.4724 1147.4474 1165.1693 1175.1455 1198.0613 1201.1528 1237.8769 1244.2921 1252.4485 1264.8338 1285.6592 1294.3397 1296.9160 1303.2876 1307.4329 1324.8147 1336.4675 1344.1641 1344.7892 1358.9424 1371.5978 1377.6089 1387.4187 1390.0873 1401.7064 1406.3233 1450.4470 1458.4438 1466.6431 1469.0851 1476.7315 1482.9252 1494.9455 1513.1961 1643.0575 2623.8033 2960.1037 2970.5782 2971.5228 2982.3098 2984.4606 2985.4018 2987.0026 3032.6117 3040.0036 3054.3727 3058.5252 3060.5640 3072.4039 3078.9116 3086.4676 3099.7743 3396.7176 3444.0739 3469.3686 3477.1538 3493.1847 3504.2729
redmass: 5.0364 5.7538 4.3910 3.8556 4.7817 5.8473 5.7504 3.9518 6.2245 4.5719 6.1808 4.1076 4.8874 3.3373 1.0742 4.1336 1.2129 4.6142 3.8650 4.4686 3.5937 4.2299 2.8055 3.1593 4.3905 2.5666 2.5356 2.3584 1.6175 1.5077 1.2504 3.0066 1.2661 3.7997 1.5116 1.0989 2.9781 3.6819 3.2689 2.7855 3.2095 3.3059 3.9703 2.3483 2.9132 2.9388 2.5708 1.2764 1.8831 2.2066 2.5924 2.0113 3.9317 3.4512 2.2517 2.5230 2.5087 2.2292 1.7110 2.6234 1.6488 2.7488 2.2536 1.6335 1.1160 1.8311 1.2343 1.4263 1.2283 1.4254 1.2921 1.2990 1.2884 1.3127 1.3051 1.3062 1.4626 1.3945 1.2611 1.4115 1.3750 1.2016 1.3425 1.2772 1.2898 1.3326 1.3500 1.2117 1.1236 1.1311 1.0583 1.0927 1.0586 1.0631 1.0505 1.1885 8.1842 1.0699 1.0646 1.0818 1.0829 1.0377 1.0373 1.0785 1.0668 1.0866 1.0909 1.1022 1.0940 1.0892 1.0987 1.0996 1.0998 1.0979 1.0735 1.0647 1.0647 1.0645 1.0640 1.0649
irintensity: 0.1867 0.2369 2.9601 2.4751 0.6005 0.1798 5.5326 8.5089 1.3469 3.3506 17.4182 2.3172 4.0900 1.4660 0.1600 6.8342 0.1470 1.6663 6.4566 7.5487 2.9937 1.7282 2.7255 0.6957 9.1464 0.7037 5.1943 27.2827 49.6193 92.0001 30.3715 4.5780 187.3793 12.1438 94.1099 241.5495 24.0105 46.2440 60.4847 30.0307 22.2569 38.3597 11.9514 2.1226 35.9738 30.6535 10.9609 2.5405 24.4113 29.3205 42.3619 20.7108 70.9588 156.0117 38.0881 122.8461 162.7437 36.5381 45.2630 34.7141 89.7157 30.5995 10.8933 65.4039 79.2586 5.9345 29.7419 10.6708 6.9917 2.7302 11.5954 19.6342 1.7139 20.2597 60.0817 6.4934 8.4678 20.4317 3.3355 26.5713 20.7025 8.8482 37.0937 126.0519 25.1786 22.1010 3.8515 17.7039 14.7109 11.7246 13.1314 1.4092 15.3906 5.1853 38.3172 85.3881 178.7429 1250.6655 47.8965 3.3296 15.1085 20.9644 23.9969 44.6617 38.3031 38.6645 15.2646 24.4641 57.4402 4.7575 19.2323 33.4318 41.9722 15.9379 9.9413 17.2339 41.7054 17.4546 25.7307 43.1831
temp: 298.150 k
press: 1.00000 atm
elementType: 8 8 8 8 8 8 8 7 6 6 6 6 6 6 6 6 6 6 6 1 1 1 1 1 1 1 1 1 1 1 1 1 1 1 1 1 1 1 1 1 1 1
symmnumber: 1
zpe: 916612.4 jmol-1
zpe.correction: 0.349119 hartree
zpe.thermalcorrener: 0.371175 hartree
zpe.thermalcorrenthalpy: 0.372119 hartree
zpe.thermalcorrgfe: 0.296738 hartree
zpe.sumelectzpe: -1012.695429 hartree
zpe.sumelectthermal: -1012.673373 hartree
zpe.sumelectthermalent: -1012.672429 hartree
zpe.sumelectthermalfe: -1012.747809 hartree
dipole: -7.1300 0.6537 -0.8903
dipole: 7.2151
quadrupole: -131.5403 -115.8345 -123.6839
quadrupole: 7.3828 -4.9408 -4.5352
quadrupole: -7.8541 7.8517 0.0023 7.3828 -4.9408 -4.5352
hfenergy: -1013.0445477 hartree
pointgroup: C01 [X(C11H23N1O7)]
dipole: 2.7766246 -0.4489731 0.3828655 debye
polarizability: 184.9606429|2.0637176|125.455295|3.3365954|-6.6080657|146.0580255 unknown
InChI: InChI=1S/C11H23NO7/c1-5(2)8(11(18)19)12-3-6(14)9(16)10(17)7(15)4-13/h5-10,12-18H,3-4H2,1-2H3
charge 0 multiplicity 1
42 atoms
O  -0.582458 -1.171475 0.961028
O  -0.100632 1.543271 0.607484
O  -3.250264 -1.304045 1.198809
O  -5.058932 0.484746 0.398839
O  -5.22747 0.086677 -2.314124
O  4.486273 1.423004 -0.728377
O  4.062683 -0.539783 -1.896543
N  1.587599 -0.708952 -0.462921
C  -1.351913 -0.466019 -0.089643
C  -0.48847 0.732398 -0.558447
C  -2.686145 -0.090674 0.577319
C  0.767832 0.237199 -1.315331
C  2.784387 -0.070763 0.170351
C  3.392379 -0.999321 1.278814
C  -3.788456 0.439456 -0.358926
C  -4.030262 -0.403124 -1.631905
C  2.519797 -0.961429 2.556078
C  4.855375 -0.630876 1.626139
C  3.823113 0.214088 -0.924275
H  -1.535854 -1.15345 -0.941415
H  -1.062331 1.403948 -1.223175
H  -2.491568 0.667802 1.36388
H  0.458299 -0.29321 -2.235408
H  1.367346 1.115908 -1.621928
H  2.473492 0.888504 0.617302
H  3.38717 -2.030654 0.866695
H  -3.587472 1.487771 -0.640397
H  1.923231 -1.497391 -1.040942
H  -3.204517 -0.289738 -2.357454
H  -4.130416 -1.47442 -1.355571
H  1.460105 -1.195962 2.3611
H  2.570887 0.039333 3.026096
H  2.894357 -1.695748 3.292025
H  4.937992 0.424637 1.942931
H  5.208047 -1.265641 2.458588
H  5.541724 -0.78838 0.774727
H  0.383064 -1.225891 0.5592
H  -0.053948 0.907333 1.375718
H  -2.489275 -1.770493 1.638489
H  -5.052922 -0.321885 0.985683
H  -5.884591 0.277991 -1.589462
H  5.175642 1.552761 -1.43685
