program: Gaussian 09
title: 000145792
version: EM64L-G09RevD.01
frameworkgroup: C1[X(C18H15N)]
method: RPBEPBE
basis: SDD
operation: Freq
keyword: #pfreq=noraman
keyword: PBEPBE/SDD
title: #p freq=noraman PBEPBE/SDD
converged: YES YES NO NO
title: Mulliken charges:
elementType: N C C C C C C C C C C C C C C C C C C H H H H H H H H H H H H H H H
charge: -0.188237 0.011252 -0.018613 0.237390 0.503351 0.483377 0.475514 0.273698 -0.411570 -0.510161 -0.518365 -0.492361 -0.379317 -0.494291 -0.473609 -0.471491 -0.243030 -0.655149 -0.665530 0.261395 0.233621 0.236455 0.237192 0.237362 0.234496 0.239296 0.238708 0.223577 0.205591 0.229242 0.246928 0.270064 0.225905 0.217311
chargesum: 0.00000
title: Mulliken charges with hydrogens summed into heavy atoms:
elementType: N C C C C C C C C C C C C C C C C C C
charge: -0.188237 0.011252 -0.018613 0.237390 0.503351 0.483377 0.475514 0.273698 -0.150175 -0.276541 -0.281910 -0.255170 -0.141955 -0.259794 -0.234312 -0.232783 -0.019453 0.026612 0.047750
polarizability: 3.61544409e+02 -1.42135405e+01 2.35154422e+02 2.62807995e+00 3.84332469e+00 8.96386033e+01
1716.lowfreq: -14.5447 -5.4121 -0.0008 0.0004 0.0005 10.2104 58.2356 74.2054 107.7317
frequency: 58.2155 74.1974 107.7142 128.2531 163.5330 196.7574 231.0770 238.1887 256.0485 271.0163 300.7948 319.2952 357.7746 403.7270 425.4251 442.1140 463.3709 477.3899 504.0631 513.1622 516.6962 546.9743 556.1963 591.1005 631.6300 662.3639 686.1660 692.7474 736.8334 754.2951 765.7545 806.2349 811.2207 829.4102 838.9346 848.2358 872.0961 909.3965 944.3352 948.8639 970.6476 973.5807 982.9919 989.2267 1053.9871 1056.9008 1092.7599 1097.2936 1113.1507 1128.5034 1151.7935 1164.8326 1173.1048 1187.7631 1205.5771 1211.8077 1232.7016 1251.2321 1256.9070 1321.4138 1349.5869 1370.8358 1394.6240 1409.6397 1422.7973 1427.5253 1430.0066 1433.2669 1451.2475 1464.3451 1468.6722 1474.5579 1482.3694 1491.5010 1497.2595 1522.1821 1544.7005 1590.2662 1604.5503 1608.6557 1631.5098 2898.2306 2919.4549 3012.0161 3026.0366 3091.4104 3116.6225 3116.7727 3119.6972 3122.9314 3124.1419 3130.3584 3142.3895 3153.7902 3154.6794 3164.3916
redmass: 3.8159 2.4764 3.2672 2.0686 4.0773 2.1162 1.9505 3.6064 1.5831 3.4068 2.8804 3.2375 4.1152 4.8132 4.2980 3.7333 3.9662 4.5862 4.4800 3.6909 4.5409 4.5891 3.4591 5.5713 3.8069 5.3626 6.9487 3.5084 2.6811 4.9684 1.2610 1.6000 4.0128 2.4371 4.1153 2.1203 2.0036 1.4754 1.6417 2.5138 4.1232 1.3906 1.4080 1.3469 1.8224 2.0393 1.2327 2.0238 2.2493 1.4198 1.3893 1.5811 1.4032 1.2737 2.1337 2.1199 1.8734 1.6291 2.1206 2.7915 2.7635 4.7114 2.6248 2.7868 3.8178 1.1701 4.3154 2.0080 1.4081 4.5557 1.0587 1.0620 1.0648 4.2151 1.3406 2.6086 5.1997 6.4739 6.8470 6.6163 7.4939 1.0528 1.0491 1.0885 1.0793 1.0998 1.0864 1.0952 1.0856 1.0881 1.0886 1.0915 1.0980 1.0989 1.0946 1.0944
irintensity: 1.4847 6.8979 5.4560 1.4917 0.6850 8.9471 2.0310 5.9354 2.0891 1.1304 0.5748 6.0435 1.7266 2.3239 1.6759 4.8196 1.4562 3.8543 2.4228 0.9882 1.1195 5.6345 2.5132 2.0656 8.0004 0.8070 1.0952 9.3905 19.5607 1.6960 15.0882 3.8834 7.2519 0.7468 2.8299 26.4846 132.8164 0.8635 6.2495 49.6151 9.8966 4.6493 0.4602 1.3500 10.1782 15.3429 10.3679 33.2234 1.9787 69.0646 1.6632 18.8221 16.7440 21.8979 26.8432 12.5086 3.1309 12.7705 1.1375 25.2568 35.0708 41.2243 13.9314 0.7002 19.2648 7.1720 4.1395 47.1226 1.6383 4.6262 26.9809 31.2296 16.7697 10.8212 0.0083 141.9055 6.7139 9.1878 0.4104 75.8970 31.5913 151.3229 195.2319 46.0333 42.7927 22.9668 1.2581 15.7344 0.6753 11.8264 4.8457 19.6065 39.4844 64.0174 15.5784 16.4479
temp: 298.150 k
press: 1.00000 atm
elementType: 7 6 6 6 6 6 6 6 6 6 6 6 6 6 6 6 6 6 6 1 1 1 1 1 1 1 1 1 1 1 1 1 1 1
symmnumber: 1
zpe: 722908.1 jmol-1
zpe.correction: 0.275341 hartree
zpe.thermalcorrener: 0.289970 hartree
zpe.thermalcorrenthalpy: 0.290914 hartree
zpe.thermalcorrgfe: 0.234599 hartree
zpe.sumelectzpe: -748.403704 hartree
zpe.sumelectthermal: -748.389075 hartree
zpe.sumelectthermalent: -748.388130 hartree
zpe.sumelectthermalfe: -748.444446 hartree
dipole: -2.5294 -0.3666 0.4782
dipole: 2.6002
quadrupole: -89.2642 -98.4116 -117.6775
quadrupole: 1.1528 -0.6057 -0.1877
quadrupole: 12.5202 3.3729 -15.8931 1.1528 -0.6057 -0.1877
hfenergy: -748.6790447 hartree
pointgroup: C01 [X(C18H15N1)]
dipole: -1.0029441 -0.127875 0.1558689 debye
polarizability: 360.6428146|-10.7641202|232.4710025|19.1700264|-19.1191574|93.223617 unknown
InChI: InChI=1S/C18H15N/c1-19(2)16-11-9-14-7-6-12-4-3-5-13-8-10-15(16)18(14)17(12)13/h3-11H,1-2H3
charge 0 multiplicity 1
34 atoms
N  -3.513869 -0.714175 -0.164493
C  0.11538 0.394109 -0.116995
C  1.434751 -0.158863 0.054971
C  -1.038909 -0.472395 -0.128483
C  -0.035797 1.817134 -0.308271
C  1.614079 -1.58492 0.185204
C  2.589106 0.710094 0.087347
C  -2.355688 0.103097 -0.252492
C  -0.819022 -1.901059 -0.066979
C  0.449275 -2.434436 0.086364
C  -1.339138 2.335889 -0.52725
C  1.134609 2.6635 -0.279205
C  -2.469682 1.50227 -0.495317
C  2.39772 2.135099 -0.079008
C  2.923082 -2.111588 0.365094
C  3.879333 0.141904 0.27277
C  4.041137 -1.253162 0.41344
C  -4.762909 -0.245747 -0.781555
C  -3.739217 -1.539879 1.042912
H  -1.67731 -2.566813 -0.195371
H  0.591719 -3.521362 0.111617
H  -1.465164 3.412775 -0.691912
H  0.999402 3.742888 -0.41821
H  -3.461403 1.94848 -0.617586
H  3.278402 2.787424 -0.051838
H  3.055128 -3.195644 0.461848
H  4.753866 0.802558 0.300881
H  5.043523 -1.672484 0.554592
H  -5.302036 0.514464 -0.168642
H  -5.440442 -1.109338 -0.911494
H  -4.560751 0.182993 -1.777042
H  -2.793897 -1.710651 1.577645
H  -4.176252 -2.521128 0.774823
H  -4.438628 -1.031535 1.744338
