program: Gaussian 09
title: 000145896
version: EM64L-G09RevD.01
frameworkgroup: C1[X(C16H22N2O6)]
method: RPBEPBE
basis: SDD
operation: Freq
keyword: #p
keyword: freq=noraman
keyword: PBEPBE/SDD
title: #p freq=noraman PBEPBE/SDD
converged: YES YES NO NO
title: Mulliken charges:
elementType: O O O O O O N N C C C C C C C C C C C C C C C C H H H H H H H H H H H H H H H H H H H H H H
charge: -0.381244 -0.235956 -0.264839 -0.244924 -0.354307 -0.248094 -0.483177 -0.591880 0.162537 0.265372 0.208482 0.009391 0.081009 -0.070950 -0.790460 -0.829111 0.117352 0.211780 0.189417 -0.462242 -0.211619 -0.219479 -0.673952 -0.670248 0.274753 0.235182 0.227232 0.263073 0.242070 0.237692 0.310602 0.392713 0.212787 0.218825 0.221585 0.232636 0.236329 0.233813 0.228124 0.238724 0.207198 0.216269 0.228739 0.235742 0.273381 0.319676
chargesum: 0.00000
title: Mulliken charges with hydrogens summed into heavy atoms:
elementType: O O O O O O N N C C C C C C C C C C C C C C C C
charge: 0.011469 -0.235956 -0.264839 -0.244924 -0.354307 -0.248094 -0.172575 0.001177 0.162537 0.265372 0.208482 0.009391 0.081009 -0.070950 -0.053293 -0.086276 0.117352 0.211780 0.189417 -0.030631 0.242603 0.250663 0.000093 0.010501
polarizability: 2.75939748e+02 -3.32315155e+00 2.62133334e+02 -5.93599753e+00 1.23985306e+01 1.40591093e+02
1716.lowfreq: -5.7944 -4.8955 -0.0008 -0.0005 -0.0002 1.0738 19.1624 26.3685 34.5025
frequency: 19.1463 26.3659 34.4703 44.0723 49.3137 58.8765 60.2956 69.1899 72.5612 90.4670 102.0814 105.9202 107.9822 126.5715 148.6651 164.9802 178.1880 190.3859 219.1051 228.3871 241.1166 248.3597 251.5755 260.7810 277.5942 296.8441 310.3638 318.7096 353.7357 359.5885 378.1024 390.1529 392.9095 425.5410 444.9623 456.8811 521.5701 562.2096 565.4789 571.8571 579.3654 602.9506 619.0869 630.7023 668.5295 693.4685 726.1208 741.9748 771.1209 786.8741 797.5667 798.1472 808.1525 823.5716 876.9262 886.9349 916.1083 918.5059 992.2687 1007.7917 1013.8936 1024.7209 1038.1751 1042.2449 1047.3192 1061.1969 1065.0549 1110.6940 1112.8146 1113.7108 1131.9940 1132.7611 1145.2342 1179.6192 1190.0077 1200.4013 1223.6537 1245.6995 1247.4313 1291.7581 1326.1160 1327.6435 1353.3924 1364.4553 1368.5800 1385.6940 1391.3063 1399.5500 1401.8871 1402.2709 1406.4845 1420.1087 1448.0685 1462.3732 1462.7038 1464.5276 1466.5548 1470.3813 1472.1529 1475.1237 1479.2026 1481.3902 1485.9334 1486.6977 1549.5107 1578.0032 1598.5331 1603.3069 1622.5612 1658.9677 2809.0862 2866.9515 2947.7370 2979.5870 2995.9879 2998.1725 3006.9974 3008.1224 3019.2670 3059.2412 3067.8978 3078.9936 3090.7735 3092.4962 3094.6088 3109.5962 3112.2777 3121.5976 3122.8781 3467.5431 3507.9571 3618.9633
redmass: 3.8190 3.7518 3.6775 4.3068 4.6418 3.7821 3.0026 2.3471 3.1137 2.8690 1.6901 2.8877 2.8269 2.8441 4.9976 3.0301 1.2754 2.6857 3.7130 1.1592 2.9024 4.6243 1.3529 1.7208 4.6148 4.4254 3.7899 4.4313 3.9378 4.0221 4.5146 2.9382 3.8963 6.9925 5.1434 5.4922 3.0480 4.5057 1.6660 4.0673 2.8580 1.7065 4.2309 4.8228 6.8151 4.5743 6.3753 6.0337 7.7592 4.8506 1.1361 1.1466 4.1086 3.8312 5.1740 3.3485 1.0946 4.9203 1.9417 3.0403 2.2499 3.1311 1.7530 1.6096 2.2364 1.7311 4.9760 2.2816 2.2644 2.2187 1.4541 1.4526 2.1228 2.7785 3.0282 1.3643 2.2932 1.1449 1.1380 3.3191 5.8745 2.8897 1.5455 1.8329 1.6037 2.8513 1.9367 1.2715 1.2728 1.3655 1.7407 3.2080 1.2305 1.0448 1.1563 1.0407 1.2143 1.0767 1.0670 1.1748 1.2091 1.2617 1.0648 1.1422 4.9519 4.9109 1.6888 8.8114 3.6741 2.0952 1.0712 1.0704 1.0867 1.0435 1.0360 1.0360 1.0380 1.0580 1.0582 1.0924 1.1065 1.1064 1.0960 1.0985 1.0984 1.1024 1.1033 1.0969 1.0991 1.0477 1.0762 1.0962
irintensity: 0.2296 1.6011 2.4998 2.5349 2.0938 7.5141 0.6076 2.5359 0.9369 0.1336 0.8676 0.0813 1.7979 0.7302 0.3615 5.9917 1.6887 3.9096 0.5579 56.2473 2.1915 4.9766 0.9939 2.6570 6.9684 0.8075 4.9161 5.4159 16.2152 19.7080 0.5260 0.9631 5.5774 15.3581 28.4470 1.0272 63.4522 2.9309 95.6419 9.0980 29.5745 148.9788 15.5720 7.6823 29.2921 11.9380 5.5718 14.8867 6.2095 5.6533 2.5515 3.0453 9.9096 5.5495 10.2530 7.2597 120.5182 18.1562 1.2360 15.0990 46.8784 184.4639 25.1286 20.0639 88.8447 9.0735 34.0667 85.9503 3.1492 3.6891 6.1311 5.7412 81.3630 346.6404 378.0740 7.7060 118.2870 0.1820 0.0550 114.4196 79.7611 105.5606 5.1723 7.9727 63.6659 178.9045 122.7944 26.5023 23.9320 13.9627 22.2838 41.6866 45.8635 25.7515 89.7438 15.0113 205.5965 3.6452 3.0169 25.2566 110.6055 56.5121 6.7111 30.2935 41.4393 110.9087 232.6842 119.9503 243.3356 18.1211 476.8140 75.1766 60.4297 16.6621 22.4680 17.4112 10.8928 23.0320 16.5411 12.9632 8.2160 3.2786 13.7683 33.4186 28.1255 36.5224 39.4015 9.3313 12.0605 17.8125 14.8923 16.3706
temp: 298.150 k
press: 1.00000 atm
elementType: 8 8 8 8 8 8 7 7 6 6 6 6 6 6 6 6 6 6 6 6 6 6 6 6 1 1 1 1 1 1 1 1 1 1 1 1 1 1 1 1 1 1 1 1 1 1
symmnumber: 1
zpe: 956893.6 jmol-1
zpe.correction: 0.364462 hartree
zpe.thermalcorrener: 0.391273 hartree
zpe.thermalcorrenthalpy: 0.392217 hartree
zpe.thermalcorrgfe: 0.304873 hartree
zpe.sumelectzpe: -1181.955115 hartree
zpe.sumelectthermal: -1181.928304 hartree
zpe.sumelectthermalent: -1181.927360 hartree
zpe.sumelectthermalfe: -1182.014704 hartree
dipole: -1.6634 -0.6441 0.0707
dipole: 1.7851
quadrupole: -139.5291 -111.7369 -145.2276
quadrupole: -4.3970 11.7261 1.0617
quadrupole: -7.3646 20.4276 -13.0631 -4.3970 11.7261 1.0617
hfenergy: -1182.3195764 hartree
pointgroup: C01 [X(C16H22N2O6)]
dipole: -0.6263682 0.3159054 0.0336449 debye
polarizability: 263.7876585|-9.1873574|266.7172442|12.0706268|30.7334383|148.1592724 unknown
InChI: InChI=1S/C16H22N2O6/c1-5-23-15(21)11-8(3)13(18-10(19)7-17)9(4)12(14(11)20)16(22)24-6-2/h18,20H,5-7,17H2,1-4H3
charge 0 multiplicity 1
46 atoms
O  2.829663 -0.613058 -0.167868
O  2.035738 -3.294309 0.426036
O  1.244539 3.162884 0.736962
O  1.208374 -3.607693 -1.72569
O  3.071887 1.810593 0.366294
O  -3.271568 0.847131 1.481946
N  -2.749916 -0.034365 -0.6241
N  -5.915608 1.15127 0.822848
C  -1.320939 -0.129412 -0.469684
C  -0.550989 1.033912 -0.210381
C  -0.73438 -1.425888 -0.610914
C  0.866598 0.878953 -0.031454
C  0.665995 -1.561931 -0.491097
C  1.471738 -0.422755 -0.212795
C  -1.237985 2.383011 -0.193416
C  -1.629842 -2.622831 -0.870378
C  1.319928 -2.897919 -0.69415
C  1.794678 1.963501 0.347064
C  -3.636697 0.394549 0.359168
C  -5.124859 0.262479 -0.023872
C  2.815912 -4.564894 0.293564
C  2.212574 4.226196 1.173571
C  3.560208 -4.755912 1.610494
C  1.375292 5.437176 1.568427
H  -1.480899 2.684858 0.840514
H  -0.602641 3.168627 -0.626205
H  -2.187009 2.332368 -0.751088
H  -1.105697 -3.574503 -0.703515
H  -1.979518 -2.6419 -1.921588
H  -2.521019 -2.587016 -0.219274
H  -3.158889 -0.428447 -1.475535
H  3.267619 0.302012 0.030854
H  -5.386107 -0.820153 0.085053
H  -5.243569 0.510007 -1.100646
H  2.109468 -5.387453 0.078212
H  3.497147 -4.459457 -0.56986
H  2.804532 3.82208 2.013498
H  2.898898 4.431919 0.333245
H  2.85431 -4.837895 2.454645
H  4.234742 -3.904771 1.803054
H  4.164367 -5.680782 1.569404
H  2.041532 6.249903 1.910666
H  0.785411 5.809595 0.713693
H  0.682295 5.187445 2.389481
H  -6.887204 0.878894 0.972265
H  -5.413807 1.426782 1.674255
