program: Gaussian 09
title: 000145773
version: EM64L-G09RevD.01
frameworkgroup: C1[X(C5H5N5)]
method: RPBEPBE
basis: SDD
operation: Freq
keyword: #p
keyword: freq=noraman
keyword: PBEPBE/SDD
title: #p freq=noraman PBEPBE/SDD
converged: NO YES NO YES
title: Mulliken charges:
elementType: N N N N N C C C C C H H H H H
charge: -0.403105 -0.025075 0.028319 -0.063227 -0.627596 0.126599 -0.080326 0.178873 -0.217187 -0.377999 0.304354 0.263829 0.245350 0.341437 0.305753
chargesum: 0.00000
title: Mulliken charges with hydrogens summed into heavy atoms:
elementType: N N N N N C C C C C
charge: -0.098751 -0.025075 0.028319 -0.063227 0.019595 0.126599 -0.080326 0.178873 0.046643 -0.132649
polarizability: 1.13698576e+02 1.75581584e+00 1.02797324e+02 1.56238980e-03 -1.74919586e-03 3.61176193e+01
1716.lowfreq: -4.5438 0.0003 0.0006 0.0007 4.8435 11.9354 139.8387 196.2225 276.4615
frequency: 139.8276 196.2214 276.4614 280.3103 309.5626 496.3764 514.7048 520.3141 560.3945 566.9850 582.2597 615.7013 674.4778 691.9123 792.4786 832.7200 837.7487 902.5448 931.8643 956.7684 1055.5716 1088.1402 1196.1495 1229.8294 1289.5011 1302.8857 1327.6352 1334.7152 1375.7900 1424.5036 1449.6650 1520.1259 1597.8100 1632.7181 3166.3945 3232.9638 3546.5278 3588.4457 3703.4245
redmass: 3.3408 4.5501 3.0678 3.4072 1.6931 5.0859 7.0903 1.1945 1.4526 3.5962 6.6974 2.3628 7.3105 7.4375 5.7786 1.6129 8.8956 7.5421 1.4273 2.1253 2.4523 3.3499 2.3126 2.3464 8.9535 4.2582 1.9702 3.9267 3.4463 2.0188 3.1656 7.2377 1.8794 2.5172 1.0920 1.0988 1.0458 1.0820 1.1038
irintensity: 0.1120 2.6244 23.5291 1.0222 127.8324 6.8254 0.4672 84.9104 201.8677 28.8475 1.7808 0.4213 7.0006 1.8997 0.8056 23.3715 10.8075 0.9562 14.4217 11.1881 26.3877 11.6741 3.6300 23.3876 1.9030 46.7545 21.4667 60.8217 83.2065 15.7585 47.9897 103.0189 10.1496 479.9010 19.3431 1.4023 85.3720 37.9574 31.5730
temp: 298.150 k
press: 1.00000 atm
elementType: 7 7 7 7 7 6 6 6 6 6 1 1 1 1 1
symmnumber: 1
zpe: 285563.1 jmol-1
zpe.correction: 0.108765 hartree
zpe.thermalcorrener: 0.116227 hartree
zpe.thermalcorrenthalpy: 0.117172 hartree
zpe.thermalcorrgfe: 0.076830 hartree
zpe.sumelectzpe: -466.586343 hartree
zpe.sumelectthermal: -466.578881 hartree
zpe.sumelectthermalent: -466.577937 hartree
zpe.sumelectthermalfe: -466.618279 hartree
dipole: 0.5500 -8.1628 0.0006
dipole: 8.1813
quadrupole: -56.2119 -49.8922 -60.1178
quadrupole: 6.1919 0.0013 -0.0015
quadrupole: -0.8046 5.5151 -4.7105 6.1919 0.0013 -0.0015
hfenergy: -466.6951084 hartree
pointgroup: C01 [X(C5H5N5)]
dipole: 0.1857627 -3.2133964 0.0002396 debye
dipolederiv: -0.4246361 0.0624208 0.0000097 -0.1072926 -0.5974417 0.0000281 0.0000009 0.0000567 -0.2491027 -0.4684087 -0.2744246 -0.0000006 -0.0606605 -0.5164952 0.0000074 -0.0000016 -0.0000057 -0.267609 -0.650929 -0.1292644 -0.0000157 -0.008747 -0.5281042 0.0000075 0.0000092 0.0000012 -0.2042821 -0.4964091 -0.138728 -0.0000012 0.2685705 -0.9309663 0.0000241 -0.00005 0.00006 -0.2375963 -0.5451668 0.5475289 -0.0000731 0.6955469 -1.1173951 -0.00009 0.0000266 -0.0002215 -0.7377854 -0.3802223 0.5856674 -0.0000271 0.4708062 -0.1086855 0.0000131 0.0000065 0.000013 0.0562521 0.6857822 0.341048 0.0000041 -0.0080095 0.4094177 -0.0000062 0.000009 -0.0000111 0.0776414 0.8903212 -0.6286188 0.0000594 -0.7016119 1.4306165 -0.0000246 0.0000521 -0.0000294 0.2253969 0.2214373 -0.2021401 0.0000168 -0.214284 0.7014997 -0.0000198 -0.0000118 -0.0000308 -0.048174 0.5931854 0.0282245 0.0000076 -0.1088725 0.6648707 -0.0000187 0.0000223 -0.0000052 -0.0678059 0.1625507 0.0539982 -0.00001 0.0294057 0.1522711 -0.0000033 -0.0000164 -0.0000184 0.3640957 0.0264131 -0.0585125 -0.0000066 -0.0592877 0.0715484 -0.0000027 0.0000095 0.0000035 0.1805218 0.0186755 -0.0947009 0.0000011 -0.0859022 -0.0278053 0.0000031 -0.0000124 -0.000015 0.1300085 0.2385176 -0.0436326 -0.0000042 -0.039447 0.1910138 0.0000328 -0.0000389 0.0000582 0.3874566 0.1288891 -0.0488662 0.0000398 -0.0702144 0.2056555 0.0000491 -0.0000051 0.0001446 0.3909823 unknown
polarizability: 113.7310421|1.6516386|102.7648577|0.0015457|-0.001764|36.1176193 unknown
InChI: InChI=1S/C5H5N5/c6-4-3-5(9-1-7-3)10-2-8-4/h1-2,7H,6H2
charge 0 multiplicity 1
15 atoms
N  -1.282277 -1.443885 0.000002
N  -2.124583 0.686283 -0.000042
N  0.059705 1.871137 -0.000027
N  2.017115 0.384231 0.000029
N  1.905451 -1.958729 0.000099
C  -0.169043 -0.588398 0.000028
C  -0.714569 0.739093 -0.000012
C  1.246094 -0.745141 0.000063
C  -2.417434 -0.621775 -0.000072
C  1.392106 1.60844 -0.000037
H  -1.288682 -2.462423 -0.000041
H  -3.426013 -1.030972 -0.000105
H  2.060739 2.474359 -0.00001
H  2.92379 -1.934087 0.000127
H  1.424302 -2.852733 0.000398
