program: Gaussian 09
title: 000145766
version: EM64L-G09RevD.01
frameworkgroup: C1[X(C8H6N2O2)]
method: RPBEPBE
basis: SDD
operation: Freq
keyword: #pfreq=noraman
keyword: PBEPBE/SDD
title: #p freq=noraman PBEPBE/SDD
converged: NO YES YES YES
title: Mulliken charges:
elementType: O O N N C C C C C C C C H H H H H H
charge: -0.220656 -0.218897 -0.410048 0.013184 0.153368 0.266453 0.267744 -0.326260 -0.359878 -0.227816 -0.399023 -0.177793 0.302017 0.316759 0.239406 0.262464 0.283529 0.235445
chargesum: 0.00000
title: Mulliken charges with hydrogens summed into heavy atoms:
elementType: O O N N C C C C C C C C
charge: -0.220656 -0.218897 -0.093289 0.013184 0.153368 0.266453 0.267744 -0.024242 -0.120472 0.034648 -0.115494 0.057652
polarizability: 1.54499193e+02 8.43887443e+00 1.37782398e+02 -9.17619431e-03 3.75315689e-03 4.14361456e+01
1716.lowfreq: -7.7420 -4.0729 -0.0011 -0.0009 -0.0008 10.0734 63.9509 134.7287 206.2747
frequency: 63.9364 134.7283 206.2745 219.1913 259.0397 366.2789 385.2497 464.1654 479.5666 540.9113 567.6287 591.3918 607.2031 625.7743 698.8859 728.2534 729.2577 781.8102 802.9144 832.2786 889.6055 893.9388 919.5682 952.2104 977.0187 1060.2674 1067.6878 1111.9739 1158.0861 1185.5040 1207.8039 1227.2818 1274.7232 1333.8595 1356.5505 1376.2488 1420.2397 1473.3874 1475.1157 1499.7744 1580.1844 1633.1211 3141.1507 3163.5515 3186.5403 3230.6956 3273.3692 3610.5979
redmass: 12.5527 5.3599 7.9897 4.3224 3.9542 9.2251 6.6515 4.8994 5.9303 1.3241 3.8065 7.7628 2.4545 5.8769 7.9131 2.4280 10.6928 1.2718 1.8910 5.4772 4.8515 1.3130 1.3852 4.5772 1.3316 1.8131 1.6254 1.5164 1.6456 1.9263 1.9347 4.2090 2.1185 2.6241 5.0402 5.2519 2.4697 5.5786 3.6175 3.6650 6.3760 7.9344 1.0886 1.0936 1.0957 1.0955 1.1026 1.0813
irintensity: 0.0298 0.0732 1.4545 10.2999 0.2635 1.6357 1.6230 8.9181 1.3225 83.9913 0.4181 1.1056 16.5589 3.1203 13.8228 4.1256 17.5752 146.6453 7.7395 3.1784 10.5094 8.0810 0.0427 4.8536 3.2275 23.6363 13.0943 43.5376 47.8486 99.2403 82.6286 194.3171 16.5381 11.8366 54.3382 126.3097 35.2791 4.8057 7.7502 26.5796 22.2032 0.6683 4.2496 12.5297 4.9430 0.2959 3.6490 77.6256
temp: 298.150 k
press: 1.00000 atm
elementType: 8 8 7 7 6 6 6 6 6 6 6 6 1 1 1 1 1 1
symmnumber: 1
zpe: 339528.9 jmol-1
zpe.correction: 0.129320 hartree
zpe.thermalcorrener: 0.138197 hartree
zpe.thermalcorrenthalpy: 0.139141 hartree
zpe.thermalcorrgfe: 0.094914 hartree
zpe.sumelectzpe: -567.492833 hartree
zpe.sumelectthermal: -567.483956 hartree
zpe.sumelectthermalent: -567.483011 hartree
zpe.sumelectthermalfe: -567.527239 hartree
dipole: -7.5224 2.1604 0.0008
dipole: 7.8264
quadrupole: -64.2443 -61.9659 -71.7327
quadrupole: 5.1872 0.0000 -0.0004
quadrupole: 1.7367 4.0150 -5.7517 5.1872 0.0000 -0.0004
hfenergy: -567.6221526 hartree
pointgroup: C01 [X(C8H6N2O2)]
dipole: -2.9647133 0.8316643 0.0003304 debye
dipolederiv: -1.084557 -0.1173757 0.0000394 -0.1843446 -0.4644048 -0.0000188 0.0000947 0.0000024 -0.2389083 -0.4716746 0.0738773 0.0000254 0.25066 -0.8052201 -0.0000521 0.0000396 -0.0000756 -0.2380394 -0.5574509 -0.0990025 0.0000233 0.3882813 -0.3419482 -0.0000341 0.0000502 0.0000042 -0.2743722 1.8433099 -0.1710273 -0.0001297 -0.4341294 1.1312819 0.0001207 -0.0001778 0.0000885 0.1810171 -0.0435652 -0.1584639 -0.0000044 0.5717178 0.2409994 -0.0000432 0.0000257 0.0000216 0.0184417 0.3977207 0.4602943 -0.0000162 -0.0460979 -0.2671891 -0.0000075 -0.0000343 -0.0000465 0.0370649 -0.5588392 0.2667786 0.0000671 0.5787357 -0.1055479 -0.0000672 0.0000675 -0.0000275 0.0462871 -0.5007904 -0.0895215 0.0000218 -0.3285389 -0.0906292 0.000032 0.0000139 0.0000141 -0.2268662 0.2580832 0.0261694 -0.0000306 0.222448 0.1932448 -0.0000077 -0.0000237 0.0000086 -0.1468593 0.5455504 -0.1654532 -0.0000648 -0.582634 0.1531356 0.0000594 -0.0000845 0.0000228 -0.1347053 0.1460638 0.0304299 -0.0000168 -0.4617635 -0.057132 0.0000427 -0.0000576 0.0000087 -0.1177854 -0.4614386 -0.0889681 0.0000218 0.0130817 0.0917493 0.0000084 0.0000222 0.000016 -0.1732 0.1003648 0.0680769 0.0000122 0.0018981 0.066026 -0.0000034 0.0000079 -0.0000116 0.2025337 0.2597604 0.0090463 0.0000068 0.0206587 0.1562631 -0.0000081 0.0000036 -0.0000084 0.3505911 -0.0415647 0.0976546 0.0000199 0.0647817 0.0460247 -0.0000093 0.0000166 -0.0000105 0.1728435 0.0417564 -0.0731807 0.0000114 -0.0559898 0.0470231 -0.0000009 0.0000145 0.0000019 0.2067098 0.0461215 -0.0566087 0.0000069 -0.0194337 0.1093036 -0.0000006 0.0000098 0.0000007 0.1721284 0.0811494 -0.0127257 0.0000065 0.0006688 -0.1029802 -0.0000103 0.0000119 -0.0000094 0.163119 unknown
polarizability: 154.3943604|8.5414325|137.8872301|-0.0091992|0.0036964|41.4361456 unknown
InChI: InChI=1S/C8H6N2O2/c11-10(12)8-3-1-2-7-6(8)4-5-9-7/h1-5,9H
charge 0 multiplicity 1
18 atoms
O  3.270474 0.13788 -0.000278
O  2.078514 -1.806884 -0.000349
N  -2.653151 -0.432846 0.000195
N  2.149931 -0.51275 -0.000186
C  -0.366068 -0.415869 0.000007
C  -1.545018 0.421727 0.000133
C  0.892638 0.251756 -0.000063
C  -0.813916 -1.786729 -0.000004
C  -1.490738 1.829104 0.000179
C  -2.210094 -1.758951 0.000109
C  0.967137 1.660369 -0.000017
C  -0.216352 2.43883 0.000102
H  -0.181286 -2.667899 -0.000082
H  -3.625673 -0.132973 0.000276
H  -2.401349 2.4380 0.000269
H  -2.916029 -2.58736 0.000141
H  1.953526 2.131017 -0.00007
H  -0.138246 3.530378 0.000137
