program: Gaussian 09
title: 000145782
version: EM64L-G09RevD.01
frameworkgroup: C1[X(C16H13ClN2O)]
method: RPBEPBE
basis: SDD
operation: Freq
keyword: #p
keyword: freq=noraman
keyword: PBEPBE/SDD
title: #p freq=noraman PBEPBE/SDD
converged: NO YES NO NO
title: Mulliken charges:
elementType: Cl O N N C C C C C C C C C C C C C C C C H H H H H H H H H H H H H
charge: -0.070732 -0.309371 -0.200984 -0.656621 0.253365 0.148789 0.199838 0.126838 0.031217 0.226848 -0.332798 -0.339484 -0.663061 -0.150701 -0.264956 -0.370406 -0.370461 -0.223358 -0.223358 -0.239153 0.274772 0.254838 0.239060 0.290302 0.239047 0.254216 0.252478 0.252469 0.332178 0.345767 0.230759 0.230757 0.231904
chargesum: 0.00000
title: Mulliken charges with hydrogens summed into heavy atoms:
elementType: Cl O N N C C C C C C C C C C C C C C C C
charge: -0.070732 -0.309371 -0.200984 0.021324 0.253365 0.148789 0.199838 0.126838 0.031217 0.226848 -0.058026 -0.084646 0.105349 -0.150701 -0.010740 -0.117928 -0.117992 0.007401 0.007399 -0.007248
polarizability: 2.47618544e+02 -3.84019128e+00 2.62396853e+02 -2.30858895e-02 4.30297314e-02 1.20729994e+02
1716.lowfreq: -26.7450 -8.5117 -6.1282 0.0011 0.0011 0.0021 6.4078 46.2615 53.3423
frequency: -26.6847 46.2547 53.3391 77.0625 99.8068 122.6219 158.8902 207.2683 224.0043 224.1679 238.4269 256.1501 298.6755 339.0970 363.2635 368.6106 396.5247 397.4338 405.2061 437.4596 451.4757 471.7357 500.8671 521.8615 558.4570 570.7285 603.4609 606.5457 638.8548 645.3871 665.3182 681.6936 709.6945 716.4824 760.9371 773.8175 798.7910 799.3274 859.3411 884.3252 905.2206 925.5242 929.2381 941.7549 981.9434 987.9385 1000.6393 1023.1352 1034.4926 1075.5308 1082.7781 1089.3012 1121.6941 1122.6361 1143.1880 1173.1214 1185.6704 1219.6472 1251.8993 1293.1634 1306.4625 1311.8255 1336.1373 1364.1950 1385.4715 1400.6489 1423.3403 1427.5264 1432.7092 1474.6394 1481.4253 1497.5967 1498.2032 1535.8099 1563.3221 1579.3660 1586.6099 1600.1013 1609.2170 1633.0671 2991.0282 3078.5345 3121.4933 3124.0533 3128.8870 3140.7320 3149.9236 3161.9489 3165.1301 3166.2855 3182.4648 3510.5555 3679.5233
redmass: 3.8433 4.8942 6.4218 7.4268 3.9212 5.5059 7.7110 4.0988 6.4204 5.1171 1.1041 4.6529 5.0387 4.1646 5.4694 4.0286 5.0357 2.8733 4.1491 1.5297 5.9203 2.8655 3.8331 8.2731 4.2040 5.6901 1.0850 5.8766 7.1865 5.8258 5.7921 5.3226 1.6346 5.0910 5.8325 2.1957 4.6315 1.5362 1.2497 1.4213 2.6740 2.2008 1.3279 2.5316 1.3836 6.2520 1.3125 2.7632 4.2494 1.6088 2.5607 1.8564 1.3155 1.8734 1.5139 1.0546 1.1133 2.8316 1.7349 2.1301 1.3991 3.2164 4.8880 6.3340 4.9527 3.4043 1.7006 2.1877 3.0222 1.8976 1.3718 2.7367 1.0451 3.4687 9.1079 5.8953 1.8763 6.0654 5.8615 5.1557 1.0344 1.1024 1.0994 1.0848 1.0878 1.0925 1.0968 1.0881 1.1016 1.0922 1.0963 1.0461 1.1026
irintensity: 0.0224 0.8741 0.3075 0.1426 0.2727 6.6637 0.0708 0.0010 1.0610 1.9721 0.0479 0.2450 5.7934 4.6751 0.5503 9.9431 17.1118 0.8337 5.3962 72.0786 0.2581 67.1928 13.6959 19.6245 0.7846 0.6365 83.2735 1.6379 3.6851 11.7079 7.4919 12.8943 70.2317 2.7047 0.3737 7.6838 40.0892 46.5102 1.3671 12.5095 0.2144 14.5490 0.2874 24.9017 0.0414 2.3301 0.0254 10.8443 2.3276 10.4034 10.8357 22.8920 0.0910 36.6544 3.4113 0.0103 1.2420 14.7318 30.2893 47.1222 0.2482 0.3273 9.6570 0.0384 8.0941 3.6636 30.4408 7.2896 39.6965 70.0971 6.7784 12.6910 19.2945 524.4161 278.8604 1.9094 9.6995 131.2766 5.6122 105.1230 40.0030 21.7569 1.4352 2.0932 0.0873 13.9636 32.1830 1.6518 22.5381 1.0414 7.5758 144.0118 55.3277
temp: 298.150 k
press: 1.00000 atm
elementType: 17 8 7 7 6 6 6 6 6 6 6 6 6 6 6 6 6 6 6 6 1 1 1 1 1 1 1 1 1 1 1 1 1
symmnumber: 1
zpe: 660758.0 jmol-1
zpe.correction: 0.251669 hartree
zpe.thermalcorrener: 0.267803 hartree
zpe.thermalcorrenthalpy: 0.268747 hartree
zpe.thermalcorrgfe: 0.208139 hartree
zpe.sumelectzpe: -1260.943486 hartree
zpe.sumelectthermal: -1260.927353 hartree
zpe.sumelectthermalent: -1260.926408 hartree
zpe.sumelectthermalfe: -1260.987016 hartree
dipole: 1.1761 -0.6612 0.0002
dipole: 1.3493
quadrupole: -96.4165 -141.8676 -120.6530
quadrupole: -1.1654 -0.0055 0.0135
quadrupole: 23.2292 -22.2219 -1.0073 -1.1654 -0.0055 0.0135
hfenergy: -1261.1951552 hartree
pointgroup: C01 [X(C16H13Cl1N2O1)]
dipole: 0.4441855 0.290668 -0.0000966 debye
polarizability: 247.1699643|2.8136449|262.8454326|0.0201393|0.0444851|120.7299938 unknown
InChI: InChI=1S/C16H13ClN2O/c1-19-13-8-7-11(17)9-12(13)14(15(18)16(19)20)10-5-3-2-4-6-10/h2-9H,18H2,1H3
charge 0 multiplicity 1
33 atoms
Cl -1.028903 -4.562043 0.000638
O  -1.663881 3.592022 0.000412
N  -2.358759 1.34268 0.000429
N  0.94095 2.937663 0.000333
C  -0.674292 -0.451935 0.000501
C  0.380346 0.541011 0.000429
C  -2.054843 -0.03774 0.000405
C  0.039367 1.894264 0.000382
C  -1.372546 2.345028 0.000563
C  1.826693 0.140147 0.000401
C  -0.386057 -1.849794 0.000625
C  -3.087128 -1.01276 0.000221
C  -3.766258 1.795431 0.000416
C  -1.427591 -2.781105 0.000518
C  -2.783967 -2.387201 0.000278
C  2.526915 -0.046578 -1.222205
C  2.527842 -0.043186 1.223006
C  3.892644 -0.41184 -1.222571
C  3.893564 -0.408453 1.223366
C  4.579874 -0.593933 0.000392
H  0.656138 -2.180657 0.000794
H  -4.136972 -0.710518 -0.000021
H  -4.291759 1.433126 -0.900757
H  -3.755664 2.895673 0.00087
H  -4.292007 1.432272 0.901087
H  -3.582458 -3.134269 0.000129
H  1.992307 0.089194 -2.169501
H  1.993916 0.095178 2.17031
H  1.943551 2.772183 0.00035
H  0.552258 3.882132 0.000418
H  4.416972 -0.5567 -2.17391
H  4.418607 -0.550694 2.174707
H  5.637641 -0.880195 0.000385
