program: Gaussian 09
title: 000145763
version: EM64L-G09RevD.01
frameworkgroup: C1[X(C6H16N2S2)]
method: RPBEPBE
basis: SDD
operation: Freq
keyword: #p
keyword: freq=noraman
keyword: PBEPBE/SDD
title: #p freq=noraman PBEPBE/SDD
converged: YES YES NO NO
title: Mulliken charges:
elementType: S S N N C C C C C C H H H H H H H H H H H H H H H H
charge: 0.013896 0.013928 -0.301358 -0.301363 -0.302881 -0.302855 -0.646087 -0.646120 -0.622806 -0.622804 0.196437 0.227997 0.196406 0.228024 0.289707 0.242152 0.289730 0.242121 0.254836 0.254836 0.193694 0.224512 0.229896 0.193693 0.224509 0.229899
chargesum: 0.00000
title: Mulliken charges with hydrogens summed into heavy atoms:
elementType: S S N N C C C C C C
charge: 0.013896 0.013928 -0.046522 -0.046527 0.121553 0.121576 -0.114229 -0.114269 0.025296 0.025298
polarizability: 1.84954813e+02 -4.68526182e-03 1.00013958e+02 4.40598233e+00 -4.57294700e-03 8.85280564e+01
1716.lowfreq: -6.9866 -3.7612 -0.0023 -0.0019 0.0029 9.0135 18.7109 26.6771 39.5437
frequency: 18.5752 24.9412 39.5149 73.2429 79.1018 85.9363 108.8823 112.8838 121.9753 161.4810 207.2179 231.5523 243.0341 288.9873 309.7803 397.6222 404.4137 446.2125 654.6505 656.1597 696.6918 701.1226 794.8443 796.5467 954.4803 954.5288 992.0271 992.6251 1039.7980 1043.2311 1090.7955 1092.3064 1117.6614 1118.8810 1156.7708 1157.2793 1201.3302 1204.3315 1248.1578 1253.1696 1273.4747 1276.4213 1362.6921 1363.5780 1435.0630 1435.2419 1445.2451 1445.2733 1452.9781 1454.1409 1466.4920 1466.5361 1486.5995 1486.6505 1496.7478 1496.7867 2858.8899 2859.0044 2880.3216 2880.5346 3018.2946 3018.3592 3020.3951 3020.4317 3031.3352 3031.9862 3079.3223 3079.3575 3122.9192 3123.0197 3449.6458 3449.6772
redmass: 3.5036 1.9957 2.1523 2.7062 2.4707 5.0103 3.9735 2.4016 2.8746 3.4724 2.4884 1.2606 1.4814 3.5957 5.6763 3.4052 3.0656 14.8746 1.4189 1.4207 4.4603 4.5483 1.1254 1.1279 2.1596 2.1475 1.3018 1.3161 3.2436 3.2347 1.1868 1.1845 1.6053 1.6152 3.4227 3.4191 1.4428 1.4677 1.3145 1.3265 1.1217 1.1173 1.3245 1.3218 1.1450 1.1462 1.1879 1.1828 1.1063 1.0994 1.0604 1.0603 1.0643 1.0646 1.0602 1.0603 1.0708 1.0709 1.0558 1.0559 1.0769 1.0768 1.0797 1.0803 1.0659 1.0658 1.0998 1.0997 1.1056 1.1058 1.0745 1.0745
irintensity: 0.7164 2.2061 0.9751 1.2201 0.6490 0.4504 0.0184 9.8106 0.8405 1.7875 3.8158 2.1810 0.0178 3.2366 2.1553 0.2244 20.0266 0.3107 17.9092 220.7191 38.2789 0.7477 7.6783 2.0744 3.8089 3.3403 16.8101 7.9053 1.8093 0.8999 34.0578 7.5976 31.0040 5.5032 67.3029 4.7697 0.6238 0.4343 5.8938 3.2225 3.3090 3.5053 1.7976 0.6911 1.5254 1.5091 42.4344 6.9577 3.3190 6.0966 20.1899 5.5680 15.8125 7.6106 5.3647 12.8189 118.2206 25.7918 344.3564 6.5751 112.5177 10.9197 0.5574 0.0449 6.5108 55.5702 6.3936 65.1889 14.3236 14.4146 0.7022 0.9859
temp: 298.150 k
press: 1.00000 atm
elementType: 16 16 7 7 6 6 6 6 6 6 1 1 1 1 1 1 1 1 1 1 1 1 1 1 1 1
symmnumber: 1
zpe: 580429.0 jmol-1
zpe.correction: 0.221074 hartree
zpe.thermalcorrener: 0.236093 hartree
zpe.thermalcorrenthalpy: 0.237038 hartree
zpe.thermalcorrgfe: 0.175187 hartree
zpe.sumelectzpe: -1142.966979 hartree
zpe.sumelectthermal: -1142.951959 hartree
zpe.sumelectthermalent: -1142.951015 hartree
zpe.sumelectthermalfe: -1143.012866 hartree
dipole: -0.0009 3.2688 -0.0019
dipole: 3.2688
quadrupole: -63.2944 -76.9009 -84.0553
quadrupole: 0.0063 6.7552 -0.0111
quadrupole: 11.4558 -2.1507 -9.3051 0.0063 6.7552 -0.0111
hfenergy: -1143.1880527 hartree
pointgroup: C01 [X(C6H16N2S2)]
dipole: 0.0001919 -1.286057 0.0039409 debye
dipolederiv: -0.1181395 0.0333836 -0.0538984 0.0084744 -0.1069679 0.0894216 -0.0444813 0.0295136 -0.0911062 -0.1178892 -0.0337788 -0.053661 -0.0087118 -0.1076853 -0.089353 -0.0447225 -0.0292547 -0.0905196 -0.8665138 -0.2187619 0.0720148 -0.1588006 -0.2207873 -0.0671401 0.0751181 -0.0869567 -0.6112972 -0.8666349 0.2190772 0.0708125 0.1590093 -0.2200368 0.0654939 0.074006 0.0854321 -0.6118423 0.3539511 0.1409012 0.145243 0.0208438 0.2753486 0.0624221 -0.1253448 -0.0612544 0.4240217 0.3536621 -0.1402818 0.1457233 -0.0212121 0.2751729 -0.0618399 -0.1248931 0.0616772 0.4242758 0.0870603 0.0518789 0.1121776 0.2144633 0.213529 0.0188114 0.3182229 0.0395145 0.039578 0.0866376 -0.0512383 0.1124441 -0.2129037 0.2136126 -0.0197115 0.3190618 -0.0406286 0.03994 0.5706778 0.0444797 -0.1319608 -0.1557849 0.0987098 -0.0351501 -0.1176206 -0.0313326 0.3688196 0.5710274 -0.0451791 -0.1315388 0.1551577 0.0990085 0.0365818 -0.1181619 0.0325936 0.3682052 -0.0056559 -0.047461 -0.0451528 -0.0564288 0.0033188 0.0117288 -0.1064982 -0.0468852 -0.2703247 0.0187895 0.0880238 -0.026276 0.0973634 -0.0880442 0.0009872 -0.0303134 0.0175609 0.053717 -0.0055045 0.047193 -0.0450205 0.0559798 0.0034819 -0.012948 -0.1065302 0.0457382 -0.2706892 0.0188226 -0.0881022 -0.0259177 -0.0974823 -0.0881162 -0.0004423 -0.0299296 -0.0170194 0.0537108 0.0487845 -0.038462 -0.0219924 -0.0544932 0.0334981 0.0064662 -0.019706 0.0141976 -0.0816545 -0.017278 0.0356798 -0.0237734 0.0101132 -0.1484148 -0.0257589 -0.0344252 -0.0081851 0.0605943 0.0489324 0.0383643 -0.0219616 0.0543326 0.0333623 -0.007035 -0.0196725 -0.0147109 -0.0814721 -0.0172674 -0.0357899 -0.0237074 -0.010253 -0.1483839 0.0267417 -0.0344453 0.0092295 0.0603631 0.0724669 0.074232 -0.0257883 0.0530522 0.0136383 0.0104271 -0.0944559 0.0968542 0.2884393 0.0726482 -0.0742426 -0.0257351 -0.0535431 0.0131498 -0.0091761 -0.0944639 -0.0956586 0.2887722 -0.1069569 -0.0338194 0.0384972 0.0127325 0.0741157 0.0225656 0.2260764 0.0715876 -0.2797067 -0.0507337 -0.0974499 -0.0333421 -0.1586246 -0.0509842 -0.0878858 -0.0470008 -0.1049222 0.0407196 0.013532 0.0533949 -0.0060312 0.1676779 -0.0967091 0.0719904 0.0004824 0.0792465 0.0579944 -0.1072909 0.034108 0.0385807 -0.0116461 0.0736729 -0.0242412 0.2263709 -0.0732339 -0.2789304 -0.0506242 0.0971661 -0.033889 0.1582696 -0.0500823 0.0885116 -0.0478793 0.1054872 0.0397009 0.0134963 -0.0533154 -0.0058467 -0.1675854 -0.0974071 -0.0714675 0.0012057 -0.0785904 0.0586914 unknown
polarizability: 184.6231255|-0.0403383|100.0138516|-7.1613254|-0.0351943|88.8598502 unknown
InChI: InChI=1S/C6H16N2S2/c1-7-3-5-9-10-6-4-8-2/h7-8H,3-6H2,1-2H3
charge 0 multiplicity 1
26 atoms
S  -0.928433 1.438731 0.64434
S  0.928613 1.434148 -0.655977
N  -4.194076 -0.941808 -0.265121
N  4.193198 -0.941707 0.269437
C  -3.379475 0.107301 0.382387
C  3.379449 0.104297 -0.384151
C  -1.985775 0.145089 -0.27011
C  1.984812 0.145012 0.266144
C  -5.617442 -0.945067 0.124955
C  5.61708 -0.946811 -0.118713
H  -3.279878 -0.028817 1.489552
H  -3.884464 1.07926 0.223724
H  3.2815 -0.037037 -1.490817
H  3.884084 1.077052 -0.229318
H  -2.058297 0.437523 -1.327807
H  -1.476641 -0.831214 -0.189231
H  2.055776 0.442605 1.322506
H  1.475946 -0.831759 0.189274
H  -3.762754 -1.870427 -0.166746
H  3.762008 -1.870791 0.174925
H  -5.796071 -1.051818 1.222888
H  -6.138644 -1.770973 -0.390525
H  -6.09004 0.000385 -0.199368
H  5.79718 -1.058738 -1.21589
H  6.137577 -1.770284 0.401354
H  6.089267 0.000148 0.201787
