program: Gaussian 09
title: 000145755
version: EM64L-G09RevD.01
frameworkgroup: C1[X(C12H9ClN4)]
method: RPBEPBE
basis: SDD
operation: Freq
keyword: #p
keyword: freq=noraman
keyword: PBEPBE/SDD
title: #p freq=noraman PBEPBE/SDD
converged: NO YES NO NO
title: Mulliken charges:
elementType: Cl N N N N C C C C C C C C C C C C H H H H H H H H H
charge: -0.063581 -0.023178 -0.016092 -0.695914 -0.696745 0.080023 0.092780 0.080239 0.045130 -0.580102 -0.581914 0.389570 0.389323 -0.329870 -0.323441 -0.092684 -0.216056 0.249777 0.248927 0.281936 0.261949 0.256711 0.325900 0.296085 0.295838 0.325391
chargesum: 0.00000
title: Mulliken charges with hydrogens summed into heavy atoms:
elementType: Cl N N N N C C C C C C C C C C C C
charge: -0.063581 -0.023178 -0.016092 -0.073929 -0.075516 0.080023 0.092780 0.080239 0.045130 -0.330325 -0.332987 0.389570 0.389323 -0.047933 -0.061492 -0.092684 0.040655
polarizability: 4.10290595e+02 -1.24732063e+01 1.60574588e+02 -7.16113735e-03 3.20078423e-02 6.30935268e+01
1716.lowfreq: -404.6143 -10.7858 -6.8760 0.0025 0.0028 0.0030 3.5045 49.4496 77.0603
frequency: -404.6139 49.4462 77.0598 130.4058 134.6890 179.2909 232.8184 241.4481 277.8485 295.5370 341.2754 350.4103 360.5985 382.9032 417.5112 425.8293 440.6223 463.9630 479.3111 481.6655 503.6954 532.8248 584.1234 597.3981 607.2885 662.7903 703.8192 716.5658 735.8950 750.9205 782.7771 800.0170 826.0954 864.3620 868.6220 872.0142 885.0521 901.3409 963.3954 1023.8415 1045.2711 1055.0666 1125.1597 1190.8332 1214.0528 1223.1940 1241.9756 1253.9714 1287.4316 1316.1186 1348.1060 1375.9963 1408.5543 1438.7631 1460.2265 1503.4763 1514.6160 1530.4507 1545.7950 1590.8474 1624.4077 1658.8616 1680.7283 3141.8606 3144.4322 3153.9881 3175.6502 3178.2227 3573.5927 3578.8996 3708.5584 3715.5464
redmass: 1.0313 8.2040 4.6826 7.4882 8.4498 5.1784 4.5554 7.0105 1.3761 7.9097 4.3488 3.4394 4.5695 3.4267 1.6126 8.1015 1.1772 2.3981 6.1041 3.5116 3.7681 3.8265 4.7768 8.1661 7.5220 6.7549 7.4147 7.4113 2.6759 4.8108 2.1569 6.4979 1.8064 1.4610 2.9469 2.0661 1.5743 5.9275 1.3201 1.5578 2.0384 1.3498 1.4390 3.0027 1.7001 2.1412 1.8596 5.5249 2.8138 2.6817 3.0204 8.2613 5.2766 6.5546 3.9730 8.3985 7.2685 7.3651 6.5973 4.7714 1.7830 2.8980 1.1269 1.0913 1.0918 1.0880 1.0947 1.0962 1.0464 1.0470 1.1030 1.1008
irintensity: 0.1177 2.2429 2.5964 1.5406 2.0580 0.1143 13.4247 3.6791 118.4360 4.4361 26.3859 0.2134 1.9393 48.1045 310.9221 12.5274 0.3711 90.3346 4.1415 0.0047 21.5353 6.8913 9.0154 1.0490 2.5285 15.8781 0.0325 1.8513 0.2899 0.3738 7.8518 6.1558 51.2688 80.0522 13.2311 0.8281 15.4755 87.9192 0.6836 4.6644 23.8064 33.2830 4.2468 26.2974 28.2816 67.4380 5.4808 5.3854 18.6243 2.2296 88.8534 20.4594 5.8318 45.4845 102.0007 7.6935 133.8313 184.5601 521.3154 38.0689 27.1819 91.7694 341.2917 13.1063 17.7616 1.3723 2.2232 7.9097 44.4512 197.3058 26.2741 16.0288
temp: 298.150 k
press: 1.00000 atm
elementType: 17 7 7 7 7 6 6 6 6 6 6 6 6 6 6 6 6 1 1 1 1 1 1 1 1 1
symmnumber: 1
zpe: 496151.9 jmol-1
zpe.correction: 0.188974 hartree
zpe.thermalcorrener: 0.202533 hartree
zpe.thermalcorrenthalpy: 0.203478 hartree
zpe.thermalcorrgfe: 0.148939 hartree
zpe.sumelectzpe: -1140.593481 hartree
zpe.sumelectthermal: -1140.579922 hartree
zpe.sumelectthermalent: -1140.578977 hartree
zpe.sumelectthermalfe: -1140.633516 hartree
dipole: 8.9322 0.1210 -0.0023
dipole: 8.9331
quadrupole: -63.2263 -95.5998 -111.2218
quadrupole: -8.1342 -0.0231 -0.0245
quadrupole: 26.7897 -5.5838 -21.2058 -8.1342 -0.0231 -0.0245
hfenergy: -1140.7824551 hartree
pointgroup: C01 [X(C12H9Cl1N4)]
dipole: 3.5090107 0.1970373 -0.0009135 debye
dipolederiv: -1.0351671 -0.2166667 -0.0000969 -0.4453305 -0.2376576 -0.0000783 -0.0002232 -0.0000912 -0.0751189 -0.1623085 0.1017644 -0.0000491 -0.0782279 -0.1981759 0.0000688 0.0001916 -0.000066 -0.2792606 0.0467392 -0.1555086 0.0000613 0.0743396 -0.1861212 0.0000489 -0.0002317 -0.0000358 -0.2726602 -1.6073158 0.5134334 0.0018099 1.0366889 -0.4924408 0.0012718 0.0052141 -0.0000158 -0.7156777 -1.7928594 -0.3786871 -0.0022117 -0.8757618 -0.3278706 0.0019843 -0.0072202 0.0008118 -0.7169978 0.3959162 -0.1648546 0.0000164 -0.8344448 0.0340305 0.0000708 -0.0004715 0.0001796 0.1225559 0.4244255 0.127592 -0.0000835 0.804185 -0.0866694 0.0000068 0.0004941 0.0001242 0.1201718 0.1685773 -0.1187742 -0.0000593 0.3775135 -0.008255 -0.0000892 0.0003242 -0.000135 0.1067834 -0.1742712 0.1579932 0.0000539 -0.2521913 -0.0619339 -0.000107 -0.0002975 -0.0001641 0.0913965 -0.6861639 0.2175658 -0.000126 -0.0446338 0.0485099 -0.0000828 -0.0016136 0.0002975 -0.2420852 -0.6565123 -0.1478109 0.0001026 0.1409415 0.0678797 -0.0001437 0.002169 0.0001941 -0.2419614 1.5142744 -0.5835682 0.0001606 -1.4005306 0.388908 -0.0006022 -0.0006121 -0.0009126 0.1099091 1.7382213 0.4432263 -0.0000268 1.2352239 0.1594974 -0.0007428 0.0005169 -0.0011739 0.1089151 -0.264809 -0.0072869 -0.0000196 -0.048048 -0.0243366 0.0000623 -0.0000522 0.0000948 -0.1336797 0.3361749 -0.043849 0.0000027 -0.170162 0.1220948 0.0001466 -0.0000675 0.0001872 -0.1570908 1.2151119 0.3874791 0.0001952 0.9137787 0.344611 0.0002109 0.0004459 0.000234 -0.0683015 -0.5366054 -0.1519921 -0.0000929 -0.4459583 -0.0238582 0.0000569 -0.0001966 0.0000599 -0.12294 0.0614541 0.0091033 0.0000705 0.073483 -0.0836015 0.0000907 -0.0000944 0.0001305 0.1697477 0.0470554 -0.0269051 -0.0000478 -0.092942 -0.0745357 0.0001363 0.0001303 0.0001438 0.1695577 0.0936528 0.0083118 0.0000103 -0.0481876 -0.0017393 -0.0000887 -0.0000165 -0.0000955 0.1708995 0.0741419 -0.0403792 -0.0000235 0.0380393 -0.0550089 -0.000112 0.0000164 -0.0001148 0.1611981 -0.0317269 0.0786309 0.0000465 0.0559202 0.0586556 -0.0000592 0.0000256 -0.0000663 0.1678393 0.1598247 -0.0562667 -0.0006525 -0.1409172 0.181042 -0.0000753 -0.000623 0.0005691 0.3818361 0.2366414 -0.0616532 -0.0007465 -0.067045 0.1572928 -0.0006393 -0.0037274 -0.0000469 0.3815852 0.2513277 0.051826 0.0009032 0.0550059 0.1417516 -0.0010802 0.0048973 -0.0006778 0.3814742 0.1842008 0.0572764 0.0008029 0.1392613 0.1579316 -0.0002543 0.0010219 0.0005691 0.3819045 unknown
polarizability: 410.8989531|-1.8149755|159.9662304|-0.0085162|0.0316742|63.0935268 unknown
InChI: InChI=1S/C12H9ClN4/c13-6-1-2-9-10(3-6)17-12-5-8(15)7(14)4-11(12)16-9/h1-5H,14-15H2
charge 0 multiplicity 1
26 atoms
Cl -5.559278 -1.13361 -0.000643
N  -0.358834 -1.342712 -0.000903
N  -0.171378 1.560728 0.000739
N  4.475364 -1.631649 0.000892
N  4.660418 1.227587 -0.001377
C  0.849893 -0.69936 -0.000609
C  0.94505 0.768518 0.000308
C  -1.479703 -0.54476 -0.000404
C  -1.385162 0.914039 0.000381
C  2.054784 -1.464216 -0.000702
C  2.238396 1.372195 0.000159
C  3.314625 -0.857015 -0.000119
C  3.409397 0.608362 -0.00052
C  -2.774059 -1.166176 -0.000701
C  -2.592803 1.689799 0.000809
C  -3.904491 -0.361682 -0.000254
C  -3.840156 1.06918 0.000504
H  1.95873 -2.555392 -0.00063
H  2.283689 2.466676 0.000028
H  -2.82742 -2.257772 -0.001288
H  -2.498871 2.780017 0.001389
H  -4.764735 1.65327 0.00083
H  4.396011 -2.645044 0.000746
H  5.412272 -1.245517 0.00613
H  5.540042 0.72471 -0.008286
H  4.711719 2.242725 -0.000975
