program: Gaussian 09
title: 000145747
version: EM64L-G09RevD.01
frameworkgroup: C1[X(C6H8N6)]
method: RPBEPBE
basis: SDD
operation: Freq
keyword: #p
keyword: freq=noraman
keyword: PBEPBE/SDD
title: #p freq=noraman PBEPBE/SDD
converged: NO NO NO NO
title: Mulliken charges:
elementType: N N N N N N C C C C C C H H H H H H H H
charge: -0.401319 -0.386263 -0.112631 -0.043470 -0.022853 -0.595120 0.082657 0.228233 -0.062192 -0.232007 -0.047852 -0.602705 0.295864 0.291622 0.258874 0.249657 0.249584 0.201731 0.328774 0.319415
chargesum: 0.00000
title: Mulliken charges with hydrogens summed into heavy atoms:
elementType: N N N N N N C C C C C C
charge: -0.105454 -0.094641 -0.112631 -0.043470 -0.022853 0.053069 0.082657 0.228233 -0.062192 0.026868 -0.047852 0.098267
polarizability: 1.43914140e+02 -6.38074856e+00 1.33812715e+02 -9.64873791e-03 -5.31594051e-04 4.83808468e+01
1716.lowfreq: -14.2005 -0.0007 0.0003 0.0008 2.6113 10.8087 72.8249 96.7836 120.9561
frequency: 72.2816 96.7528 120.9525 168.1972 209.1696 214.3518 278.7557 303.6149 358.1895 369.5075 410.3288 471.4795 519.8035 524.6750 531.3079 595.5308 605.4102 661.9178 688.0907 716.6916 776.8276 780.0277 815.1075 901.3597 971.7495 987.6548 1058.8044 1080.5744 1126.1764 1129.0103 1165.1402 1205.2389 1271.1005 1306.4268 1334.2940 1362.7279 1409.5694 1425.3386 1447.3586 1453.9056 1463.4219 1483.6140 1502.9454 1552.8141 1594.3225 1621.9865 2980.4058 3060.4632 3091.7740 3231.3097 3567.0597 3588.2349 3602.8425 3729.1646
redmass: 1.3459 2.2245 3.2866 3.2853 3.1742 3.8797 1.7399 3.6405 6.3995 3.3785 1.1929 6.2477 1.2048 1.1985 8.3823 5.8341 2.6764 6.2060 4.1196 11.6243 6.0612 8.8853 1.6081 7.5143 3.9164 3.4257 2.3339 1.9113 1.2782 3.7228 1.9103 2.3131 2.7100 8.3373 3.5545 2.3731 2.8727 2.5028 1.4695 1.0414 2.2710 2.1296 1.2601 8.0103 1.6924 4.2366 1.0337 1.1013 1.1012 1.0983 1.0438 1.0817 1.0781 1.1060
irintensity: 1.4734 1.1017 10.9707 0.1074 2.5725 26.6421 50.7755 5.7896 9.5801 12.0130 305.8863 1.6402 38.1569 145.6264 0.3979 1.1693 0.7102 3.5260 1.8152 5.0565 5.1241 0.9966 33.0664 1.1732 7.7071 10.0190 1.4384 17.9418 1.6099 31.0321 1.2741 5.9558 28.1271 92.7650 6.8140 90.0357 20.4968 40.3610 15.1197 12.2979 31.7058 131.3910 13.6712 527.5544 321.8945 438.8832 68.7109 31.4727 25.0925 2.3029 103.8100 23.2933 42.4862 42.9686
temp: 298.150 k
press: 1.00000 atm
elementType: 7 7 7 7 7 7 6 6 6 6 6 6 1 1 1 1 1 1 1 1
symmnumber: 1
zpe: 400723.6 jmol-1
zpe.correction: 0.152628 hartree
zpe.thermalcorrener: 0.163382 hartree
zpe.thermalcorrenthalpy: 0.164326 hartree
zpe.thermalcorrgfe: 0.116318 hartree
zpe.sumelectzpe: -561.091939 hartree
zpe.sumelectthermal: -561.081185 hartree
zpe.sumelectthermalent: -561.080241 hartree
zpe.sumelectthermalfe: -561.128249 hartree
dipole: -3.1270 -6.0311 0.0009
dipole: 6.7935
quadrupole: -68.1422 -50.6646 -73.4190
quadrupole: -12.9246 -0.0009 -0.0048
quadrupole: -4.0669 13.4107 -9.3437 -12.9246 -0.0009 -0.0048
hfenergy: -561.244567 hartree
pointgroup: C01 [X(C6H8N6)]
dipole: 1.3247289 -2.3213913 -0.0003603 debye
dipolederiv: -0.3464487 0.0631305 0.0000098 0.0019531 -0.641012 0.0000186 0.0000132 0.0000514 -0.2378609 -0.9067148 0.4936358 0.0002091 0.7604227 -0.9459944 0.0001556 -0.0003531 0.0007804 -0.518879 -0.4801218 0.0490262 0.0000122 -0.0248071 -1.330534 0.0000055 0.0000151 0.0000068 -0.2511602 -0.4281267 -0.3196667 0.0000222 0.0086746 -0.5920845 0.0000049 0.0000036 0.0000281 -0.2801076 -0.8590936 -0.6894804 0.0000818 -0.0323143 -0.8354045 -0.0000108 0.0000445 0.000056 -0.2547329 -0.5339685 -0.6567624 0.0000507 -0.6681813 -1.3039193 0.0001434 0.0001938 0.0003859 -0.7434168 -0.7190332 0.5505075 0.0000529 0.3422445 -0.093637 -0.0000434 0.0000758 -0.0000699 -0.0003612 1.2911302 -0.5467295 -0.000046 -0.6555329 1.4194127 -0.0000158 0.0000088 -0.0000936 0.223658 0.6651773 0.533047 -0.0000463 0.1159599 0.849423 -0.0000088 -0.0000274 -0.0000565 0.0760046 0.2051263 -0.2494047 -0.0000144 -0.3571196 0.6309553 0.000009 -0.0000356 -0.0000141 -0.0705361 0.9698539 0.7594498 -0.0001107 0.5876503 1.8133666 -0.0001115 -0.0001113 -0.0001704 0.1702003 0.6025295 -0.1270816 -0.0003086 0.013471 0.1963077 -0.0001459 -0.0000794 -0.0002556 0.2409215 0.1558014 0.0577887 0.0000129 0.0296718 0.1475723 -0.0000087 0.0000033 -0.0000319 0.358831 0.040189 -0.0370266 -0.0000024 -0.0772554 0.1721508 -0.0000799 0.0000907 -0.0003542 0.3337737 0.0299684 -0.0693282 0.0000112 -0.0729011 0.0456261 0.0000066 0.0000197 0.0000106 0.1838493 -0.0299567 0.0321286 -0.0369041 -0.0969795 0.0747277 -0.0938752 -0.0975423 -0.0507896 -0.0666875 -0.0301887 0.0323485 0.0369356 -0.0968421 0.0748126 0.0938817 0.0977622 0.0506218 -0.0670826 0.0246424 0.048823 0.0000258 0.15009 -0.1564619 0.0001083 0.0000259 0.0001286 0.1229473 0.1458088 0.0034342 0.0000296 0.0303611 0.2690268 -0.000031 -0.0000109 -0.0001326 0.3933826 0.2034256 0.0721604 -0.0000215 0.0414341 0.2056661 -0.0000024 -0.0000967 -0.0001011 0.3872564 unknown
polarizability: 143.3847262|6.7662035|134.342129|-0.0096623|0.0001429|48.3808468 unknown
InChI: InChI=1S/C6H8N6/c1-8-4-3-5(10-2-9-3)12-6(7)11-4/h2,8-9H,7H2,1H3
charge 0 multiplicity 1
20 atoms
N  -1.532132 -1.724997 0.000068
N  1.683762 -1.813816 -0.000047
N  1.495306 0.530888 -0.000147
N  -2.653757 0.273917 0.00012
N  -0.659101 1.74259 0.000012
N  1.392886 2.864394 -0.000255
C  -0.543479 -0.722588 0.00001
C  0.883005 -0.684501 -0.000078
C  -1.265646 0.51725 0.000047
C  -2.76625 -1.064151 0.000132
C  0.70585 1.668081 -0.000103
C  3.14594 -1.729142 -0.000698
H  -1.399026 -2.734656 0.000019
H  1.241629 -2.730107 -0.000472
H  -3.710411 -1.605423 0.000204
H  3.514434 -1.18797 0.889735
H  3.513816 -1.188893 -0.891974
H  3.564334 -2.750913 -0.000291
H  0.861194 3.730006 -0.000042
H  2.407947 2.855231 -0.000141
