program: Gaussian 09
title: 000145768
version: EM64L-G09RevD.01
frameworkgroup: C1[X(C16H14N4S)]
method: RPBEPBE
basis: SDD
operation: Freq
keyword: #p
keyword: freq=noraman
keyword: PBEPBE/SDD
title: #p freq=noraman PBEPBE/SDD
converged: YES YES NO NO
title: Mulliken charges:
elementType: S N N N N C C C C C C C C C C C C C C C C H H H H H H H H H H H H H H
charge: 0.207709 -0.657045 -0.376500 -0.657595 -0.374708 0.648358 -0.403163 -0.240309 -0.412770 0.537608 -0.405758 -0.445117 0.354384 -0.382401 -0.397889 -0.388735 0.358917 -0.378382 -0.381937 0.064214 0.068338 0.253383 0.300054 0.241855 0.219815 0.235976 0.226231 0.215196 0.285447 0.313539 0.315348 0.212834 0.314494 0.315842 0.212765
chargesum: 0.00000
title: Mulliken charges with hydrogens summed into heavy atoms:
elementType: S N N N N C C C C C C C C C C C C C C C C
charge: 0.207709 -0.028157 -0.163666 -0.027258 -0.161942 0.648358 -0.403163 -0.240309 -0.159387 0.537608 -0.105704 -0.203262 0.354384 -0.162586 -0.161913 -0.162505 0.358917 -0.163186 -0.096490 0.064214 0.068338
polarizability: 5.14002723e+02 1.12373112e+00 2.18768722e+02 6.86252640e-01 1.57051112e+00 8.82298117e+01
1716.lowfreq: -3.6459 -0.0020 -0.0011 0.0013 3.5194 6.6319 17.3032 28.4178 52.7213
frequency: 17.2631 28.3950 52.7096 57.8116 62.0340 77.5358 138.8610 159.1161 191.0703 197.2561 210.1114 244.2670 302.5715 330.1768 338.6442 395.0449 399.0793 413.2859 416.5158 427.0170 437.0321 445.6843 451.9776 467.4456 481.7879 497.8797 508.9360 544.3931 558.7423 578.3416 585.5035 626.5731 646.4868 661.2478 673.3248 683.4203 743.8433 748.4243 759.8505 771.1175 806.1593 811.5915 823.1935 838.7575 860.3934 867.7442 874.6044 926.2016 936.0325 958.6325 959.2438 998.9439 1009.4270 1035.7247 1038.3989 1040.8264 1073.2383 1073.7825 1122.7517 1131.1043 1144.1921 1161.2194 1201.7054 1210.8875 1236.3579 1250.5307 1309.3988 1321.7487 1354.3356 1369.0418 1385.3493 1386.5789 1419.5126 1422.9966 1477.6483 1495.6627 1539.5213 1556.4974 1566.9186 1596.3585 1598.2638 1608.8434 1620.5452 1634.6328 1636.2460 3119.5857 3126.8692 3142.0236 3144.2967 3150.6889 3166.0356 3169.7230 3173.6802 3327.5254 3328.5069 3535.4970 3537.9131 3680.3163 3681.7345
redmass: 4.3808 6.6829 5.0401 4.4840 5.2845 6.3915 5.1941 5.7822 6.6542 4.9395 5.5968 4.9990 5.1166 5.2998 4.0056 2.2983 4.8758 1.3934 1.4110 2.8238 2.6045 1.3336 1.2502 2.5720 6.2222 4.2202 4.1311 3.2127 4.0371 3.4010 3.3667 6.8856 3.1239 5.4578 5.4427 3.7190 4.7504 3.3820 4.0743 5.2318 1.3882 1.3547 1.3663 1.3312 4.1192 1.7742 1.7023 4.7097 1.4726 1.3972 1.4073 1.4667 2.6438 1.7916 2.3025 1.8498 1.5896 1.5604 1.5179 2.2826 1.9708 1.4038 1.2858 1.1880 3.7604 1.6148 1.4642 2.0532 3.9468 4.6862 4.0484 3.1122 4.9315 4.2483 3.9636 3.1200 5.5680 6.2435 6.0547 3.4686 3.5171 6.2899 6.0497 1.3996 1.3661 1.0869 1.0867 1.0931 1.0914 1.0967 1.0928 1.0956 1.0940 1.0762 1.0762 1.0450 1.0451 1.1035 1.1034
irintensity: 6.1332 1.4040 3.5075 12.8948 1.6625 0.2726 1.6719 0.9772 0.2196 1.3089 19.9609 0.2342 5.8025 3.4940 2.0301 27.7770 38.5115 143.2694 29.3172 7.1716 2.1354 49.6338 300.9013 37.5914 2.7123 2.1204 11.8371 49.5662 7.9660 1.4767 2.2334 1.6850 5.1004 2.7499 9.9217 17.3115 10.3002 4.9017 7.1749 6.1038 36.7635 73.9046 25.9178 58.1559 2.2844 75.7742 54.9139 8.0643 26.8733 0.3745 0.8639 11.4768 6.2401 5.2726 1.9617 8.7531 265.2318 33.3538 8.8561 24.8950 43.2422 11.6153 12.4736 5.0297 3.5771 7.8573 2.8364 0.3571 4.4356 216.6149 132.4553 85.3053 1.8651 55.2970 9.2803 15.0305 21.2819 65.8538 4.2304 214.7621 1.8627 4.2499 19.0563 216.3577 190.3494 27.2416 12.1716 18.8682 0.9031 24.3845 2.5845 3.4218 7.3696 32.8711 32.2918 22.9195 21.8408 20.0465 20.6994
temp: 298.150 k
press: 1.00000 atm
elementType: 16 7 7 7 7 6 6 6 6 6 6 6 6 6 6 6 6 6 6 6 6 1 1 1 1 1 1 1 1 1 1 1 1 1 1
symmnumber: 1
zpe: 701651.2 jmol-1
zpe.correction: 0.267245 hartree
zpe.thermalcorrener: 0.285855 hartree
zpe.thermalcorrenthalpy: 0.286799 hartree
zpe.thermalcorrgfe: 0.218805 hartree
zpe.sumelectzpe: -1233.720881 hartree
zpe.sumelectthermal: -1233.702272 hartree
zpe.sumelectthermalent: -1233.701328 hartree
zpe.sumelectthermalfe: -1233.769321 hartree
dipole: 0.6666 0.2938 2.2129
dipole: 2.3298
quadrupole: -72.7436 -120.8948 -139.0019
quadrupole: 35.1348 2.2971 -0.4931
quadrupole: 38.1365 -10.0147 -28.1218 35.1348 2.2971 -0.4931
hfenergy: -1233.9881263 hartree
pointgroup: C01 [X(C16H14N4S1)]
dipole: 0.2593567 -0.4690881 0.7435314 debye
polarizability: 513.9841272|-2.8538505|164.1002888|1.0346187|64.4174346|142.91684 unknown
InChI: InChI=1S/C16H14N4S/c17-15(18)10-3-1-9(2-4-10)13-7-11-5-6-12(16(19)20)8-14(11)21-13/h1-8,17,19H,18,20H2
charge 0 multiplicity 1
35 atoms
S  0.649634 -1.067463 -0.986183
N  6.966394 -0.004472 0.394596
N  6.141339 -1.210435 -1.537327
N  -6.78497 -1.06833 -0.732742
N  -6.794845 1.065563 0.410887
C  1.90399 0.839718 0.428707
C  2.181969 -0.290947 -0.409231
C  -0.334688 0.180769 -0.068871
C  0.489998 1.076397 0.597996
C  -1.801132 0.133161 -0.108277
C  3.487245 -0.704252 -0.709213
C  3.004482 1.567979 0.957307
C  4.572535 0.021475 -0.159072
C  4.316794 1.16023 0.665162
C  -2.496114 -0.726669 -1.003879
C  -2.581995 0.962252 0.753362
C  -4.671484 0.053533 -0.165191
C  -3.903473 -0.766444 -1.031996
C  -3.983587 0.924989 0.7207
C  5.962925 -0.442219 -0.478945
C  -6.170596 0.043752 -0.145808
H  0.102308 1.907503 1.191984
H  3.716124 -1.555028 -1.357349
H  2.824124 2.4507 1.580505
H  5.150825 1.762694 1.042732
H  -1.930582 -1.357469 -1.69962
H  -2.085082 1.630949 1.463873
H  -4.390158 -1.413602 -1.771333
H  -4.588848 1.563007 1.371576
H  7.938622 -0.244896 0.213944
H  6.741917 0.430834 1.286271
H  7.127779 -1.515743 -1.668106
H  -7.7998 -1.117432 -0.791018
H  -6.254432 -1.89438 -0.998705
H  -7.831417 0.970276 0.407364
