program: Gaussian 09
title: 000145759
version: EM64L-G09RevD.01
frameworkgroup: C1[X(C11H20N4O2)]
method: RPBEPBE
basis: SDD
operation: Freq
keyword: #p
keyword: freq=noraman
keyword: PBEPBE/SDD
title: #p freq=noraman PBEPBE/SDD
converged: YES YES NO NO
title: Mulliken charges:
elementType: O O N N N N C C C C C C C C C C C H H H H H H H H H H H H H H H H H H H H
charge: -0.273020 -0.273000 -0.247778 -0.247789 -0.339776 -0.339765 -0.408870 -0.420982 -0.420962 -0.408894 -0.372816 -0.358807 -0.358805 0.207780 0.207752 -0.409908 -0.409977 0.268646 0.242294 0.258334 0.243177 0.243177 0.258342 0.268652 0.242293 0.197167 0.197160 0.229731 0.205093 0.229723 0.205099 0.212881 0.252292 0.212910 0.252320 0.328160 0.328164
chargesum: 0.00000
title: Mulliken charges with hydrogens summed into heavy atoms:
elementType: O O N N N N C C C C C C C C C C C
charge: -0.273020 -0.273000 -0.247778 -0.247789 -0.011616 -0.011600 0.102070 0.080529 0.080557 0.102052 0.021511 0.076017 0.076017 0.207780 0.207752 0.055265 0.055253
polarizability: 1.98261572e+02 -1.83923630e+01 1.31040157e+02 3.17572343e-01 -4.98436501e-03 1.30517766e+02
1716.lowfreq: -3.9256 -0.0007 0.0004 0.0007 6.2259 10.0488 16.3869 18.9662 23.2526
frequency: 10.1026 18.7989 23.2249 26.4057 30.4869 46.0833 48.1598 102.4292 126.8238 128.7043 149.4665 200.9703 223.3693 243.1776 249.5044 287.7676 290.6451 328.4483 338.3359 411.3653 433.5103 521.2442 522.5595 589.8213 590.8209 618.6510 621.7456 712.3320 712.8748 737.2660 740.0206 756.2406 773.9397 775.1038 801.1383 818.5044 821.6475 859.6009 892.1944 902.7247 916.2518 956.6643 992.6487 995.0772 997.8451 1061.3853 1069.3030 1069.5723 1088.8701 1098.5340 1106.5548 1109.6508 1109.9104 1116.6582 1127.9647 1128.5033 1159.9576 1160.0772 1168.2375 1186.6673 1194.1996 1237.8590 1251.7216 1253.0851 1265.1796 1281.6314 1293.9465 1310.6021 1343.2925 1352.1951 1364.7798 1372.1967 1436.0906 1436.1434 1448.1108 1448.6382 1450.1199 1450.6787 1461.3081 1462.8313 1478.9236 1479.1885 1483.6774 1634.9587 1636.1403 2952.1248 2978.4377 2983.2019 2997.4104 2998.4889 3001.0142 3040.9305 3052.8240 3071.9191 3072.6140 3083.2887 3083.4125 3089.8162 3089.8737 3192.2203 3192.3642 3210.3654 3210.4684 3565.7544 3566.1907
redmass: 4.6280 5.7064 8.3417 4.2888 3.8274 3.8407 3.3445 3.7972 1.7965 4.4327 2.7919 3.3624 2.5704 3.0777 2.8368 4.0686 5.3233 3.5224 2.9270 3.0110 3.5018 2.6282 2.6389 3.6421 3.6695 1.1560 1.1464 6.6517 7.4878 1.3785 2.4460 2.3846 7.3070 6.8476 1.6312 1.1673 1.3192 2.5154 2.2995 2.8028 3.0420 2.3564 1.4409 1.1084 1.4965 2.9727 1.2434 1.2431 3.3229 2.5805 3.0369 1.2958 1.2963 2.0819 1.5344 1.5675 1.3800 1.3826 1.3336 1.8840 2.1950 1.5178 3.1192 2.7331 1.2693 1.2865 1.0689 1.1807 1.3985 1.4047 1.2787 1.4308 1.0848 1.0876 1.1424 1.1273 1.2329 1.2317 1.0890 1.0754 1.5064 1.6706 1.3181 8.3686 8.5557 1.0585 1.0616 1.0606 1.0753 1.0643 1.0844 1.0996 1.1012 1.1028 1.1032 1.0479 1.0479 1.0597 1.0597 1.1188 1.1188 1.1184 1.1184 1.0773 1.0773
irintensity: 0.1685 8.4467 1.8108 2.0185 11.3481 1.3307 0.6761 0.3221 0.4357 0.7002 0.5348 1.2348 9.0046 1.3174 3.1403 3.6883 27.7675 0.3371 7.8294 1.0242 4.8821 0.3545 0.8665 0.5926 19.5886 170.2617 57.0798 6.4163 0.7592 23.2201 0.2320 22.4275 8.1988 13.1783 10.1679 8.3656 7.6736 30.6387 0.4035 6.4194 17.1611 187.4027 3.6599 0.4178 4.6768 11.8010 7.5510 2.7777 0.7169 28.0211 2.1914 13.7749 10.9765 11.1708 5.4378 6.5587 0.5587 0.4758 0.3886 79.6089 42.7423 13.4262 10.6850 238.8663 19.9175 13.3004 0.8630 74.2145 1.7237 1.2532 4.6169 8.6569 8.2468 8.4177 87.6538 23.1613 25.7115 26.5890 1.0053 4.4782 168.9571 392.8605 0.2330 240.7573 208.8359 18.6280 3.3937 62.6992 61.3777 1.8554 9.3547 0.0378 100.1279 16.0214 23.8701 20.1845 20.9639 31.9231 11.1981 2.2463 2.2485 13.3526 14.1769 20.1877 43.6878
temp: 298.150 k
press: 1.00000 atm
elementType: 8 8 7 7 7 7 6 6 6 6 6 6 6 6 6 6 6 1 1 1 1 1 1 1 1 1 1 1 1 1 1 1 1 1 1 1 1
symmnumber: 1
zpe: 815654.4 jmol-1
zpe.correction: 0.310666 hartree
zpe.thermalcorrener: 0.329558 hartree
zpe.thermalcorrenthalpy: 0.330502 hartree
zpe.thermalcorrgfe: 0.257344 hartree
zpe.sumelectzpe: -799.212587 hartree
zpe.sumelectthermal: -799.193695 hartree
zpe.sumelectthermalent: -799.192751 hartree
zpe.sumelectthermalfe: -799.265909 hartree
dipole: -0.0002 -0.0615 -3.5565
dipole: 3.5571
quadrupole: -107.3675 -96.3457 -106.8492
quadrupole: -5.9740 0.1038 -0.1791
quadrupole: -3.8467 7.1751 -3.3284 -5.9740 0.1038 -0.1791
hfenergy: -799.5232535 hartree
pointgroup: C01 [X(C11H20N4O2)]
dipole: -0.0000194 1.3994624 -0.0015966 debye
polarizability: 197.7984079|-0.0238954|130.5177439|-19.2171625|-0.0022397|131.5033437 unknown
InChI: InChI=1S/C11H20N4O2/c16-10(14-6-7-14)12-4-2-1-3-5-13-11(17)15-8-9-15/h12-13H,1-9H2
charge 0 multiplicity 1
37 atoms
O  -4.569488 -1.177157 -0.473018
O  4.569549 -1.176333 0.475375
N  -4.707852 1.07156 0.456334
N  4.707495 1.070387 -0.458864
N  -2.881822 0.407151 -0.823824
N  2.882105 0.408775 0.823642
C  -5.768402 0.597465 1.441045
C  -6.199978 1.250269 0.152207
C  6.199877 1.249474 -0.156246
C  5.767229 0.59406 -1.443394
C  0.00014 -0.431192 0.000986
C  -1.011646 -1.29015 -0.789266
C  1.011954 -1.288592 0.792877
C  -4.080475 -0.020061 -0.310278
C  4.080499 -0.019565 0.310435
C  -2.011838 -0.463442 -1.632074
C  2.012287 -0.46017 1.633856
H  -5.908058 -0.486737 1.515498
H  -5.782488 1.162846 2.376921
H  -6.625323 0.592688 -0.614761
H  -6.529617 2.292899 0.137654
H  6.52969 2.292079 -0.144121
H  6.625688 0.59343 0.611778
H  5.90665 -0.490318 -1.515695
H  5.780702 1.15748 -2.380461
H  -0.548759 0.229667 0.704205
H  0.549067 0.228285 -0.703508
H  -1.584101 -1.936213 -0.096104
H  -0.462998 -1.966618 -1.475716
H  1.584312 -1.93607 0.100962
H  0.463363 -1.963641 1.480765
H  -1.466488 0.171732 -2.355983
H  -2.66739 -1.148761 -2.197723
H  1.467065 0.176501 2.356546
H  2.667935 -1.144322 2.200805
H  -2.597091 1.355292 -0.5740
H  2.597306 1.356401 0.571948
