program: Gaussian 09
title: 000145758
version: EM64L-G09RevD.01
frameworkgroup: C1[X(C15H14N2O)]
method: RPBEPBE
basis: SDD
operation: Freq
keyword: #p
keyword: freq=noraman
keyword: PBEPBE/SDD
title: #p freq=noraman PBEPBE/SDD
converged: YES YES NO NO
title: Mulliken charges:
elementType: O N N C C C C C C C C C C C C C C C H H H H H H H H H H H H H H
charge: -0.482118 -0.415877 -0.057765 0.286414 0.208277 0.250120 -0.092183 -0.100519 -0.365495 -0.320074 -0.355699 -0.320480 -0.315895 -0.292745 -0.285514 -0.343520 -0.234771 -0.236004 0.333262 0.230069 0.246270 0.247125 0.201438 0.263034 0.263572 0.224818 0.224343 0.207262 0.213547 0.228265 0.228530 0.362314
chargesum: 0.00000
title: Mulliken charges with hydrogens summed into heavy atoms:
elementType: O N N C C C C C C C C C C C C C C C
charge: -0.119804 -0.082615 -0.057765 0.286414 0.208277 0.250120 -0.092183 -0.100519 0.110844 -0.072949 -0.154262 -0.057446 -0.052323 -0.067927 -0.061171 0.077288 -0.006506 -0.007474
polarizability: 2.60094295e+02 3.67584984e+01 2.52572388e+02 -9.92897842e+00 1.03943464e+01 8.41614305e+01
1716.lowfreq: -2.5359 0.0002 0.0005 0.0005 8.6190 10.7094 36.9187 56.0760 86.4481
frequency: 36.6126 56.0668 86.4184 92.7642 113.5850 147.0615 192.3666 238.2759 254.1848 281.3428 304.2267 310.3573 344.4382 395.9969 416.4327 433.2970 467.4618 473.1100 509.5290 544.7662 577.5913 585.2061 607.3625 640.9187 644.2444 671.1510 683.2736 743.7863 762.0899 765.3498 796.6278 821.1358 849.7104 863.3201 872.1904 876.0919 899.4058 929.6174 950.6939 956.0486 988.6246 989.6967 1013.6302 1023.5142 1027.7985 1072.4571 1077.5330 1108.0517 1130.7935 1158.3579 1165.4418 1181.4079 1188.8019 1217.1546 1228.4203 1250.1871 1270.6316 1284.7419 1296.3005 1346.4940 1361.2454 1381.2437 1397.3931 1401.9446 1435.0728 1442.2817 1450.1698 1464.6310 1471.8460 1474.2174 1512.5633 1525.5582 1554.3446 1556.1419 1611.5729 1628.6169 2961.3862 2973.6578 3025.5651 3079.4579 3111.5603 3127.5773 3132.4586 3143.4706 3151.6796 3162.5608 3168.3019 3170.9519 3517.4959 3598.0739
redmass: 4.6014 4.7705 3.0842 4.2363 3.8891 4.2543 5.0164 4.5402 4.7343 1.3212 2.9048 3.2048 2.8961 6.5040 3.3995 5.0209 3.2581 3.5018 3.3331 3.4616 3.4268 4.7960 4.7781 4.4675 4.4765 1.7548 3.4674 3.3900 1.3896 1.4468 2.7524 3.8667 2.9023 1.7391 1.9347 3.3613 3.2580 4.3325 1.3672 1.3621 1.3212 1.3251 2.8782 2.4255 2.2097 2.4771 1.8998 2.0916 1.6731 1.1820 1.2291 1.3325 1.3244 1.3309 1.4932 2.6863 1.4962 1.5508 2.8438 1.6159 1.7170 3.2323 1.4596 3.4725 2.4406 2.4554 2.7262 1.2367 1.8058 1.1632 4.1509 6.1681 3.3074 6.6787 5.5941 6.4280 1.0554 1.0685 1.1070 1.0962 1.0861 1.0853 1.0882 1.0893 1.0944 1.0944 1.0993 1.0991 1.0744 1.0669
irintensity: 1.5703 1.1336 3.9067 5.5046 1.7937 13.2526 1.0921 0.1603 0.9619 106.4027 28.4176 9.3766 31.2108 1.7996 8.7457 0.6595 9.6384 3.0028 0.5869 7.2129 2.8577 4.0168 3.5122 5.0056 12.6738 85.2577 8.8475 5.3543 71.2149 118.3870 3.4721 1.5188 14.9990 1.7310 4.1834 9.0478 0.3429 18.7142 2.1923 1.9386 0.2942 0.5591 58.9030 6.7247 36.0986 2.6433 2.0937 0.1019 17.6073 9.6214 13.2577 32.1241 3.9023 1.8120 7.0442 4.3101 28.1705 0.9817 12.9481 31.4463 6.5482 25.1365 2.6153 34.2942 26.5540 21.2584 0.8741 43.4866 1.1352 13.2610 276.9366 52.9535 156.4406 49.5564 33.0988 12.8721 63.0244 37.3729 81.0936 15.6416 5.1413 5.4363 12.8998 12.3304 26.7574 22.2429 35.9808 27.3471 81.2804 10.1796
temp: 298.150 k
press: 1.00000 atm
elementType: 8 7 7 6 6 6 6 6 6 6 6 6 6 6 6 6 6 6 1 1 1 1 1 1 1 1 1 1 1 1 1 1
symmnumber: 1
zpe: 671148.0 jmol-1
zpe.correction: 0.255627 hartree
zpe.thermalcorrener: 0.270407 hartree
zpe.thermalcorrenthalpy: 0.271351 hartree
zpe.thermalcorrgfe: 0.213415 hartree
zpe.sumelectzpe: -763.457835 hartree
zpe.sumelectthermal: -763.443055 hartree
zpe.sumelectthermalent: -763.442111 hartree
zpe.sumelectthermalfe: -763.500047 hartree
dipole: 4.2715 -4.1136 1.4573
dipole: 6.1067
quadrupole: -87.7453 -92.2855 -110.2779
quadrupole: 0.1030 5.5635 -4.4639
quadrupole: 9.0243 4.4841 -13.5084 0.1030 5.5635 -4.4639
hfenergy: -763.7134617 hartree
pointgroup: C01 [X(C15H14N2O1)]
dipole: -1.1650808 -2.0228189 0.5683781 debye
polarizability: 270.2366123|-34.2578779|242.3643966|8.2341272|12.150923|84.2271049 unknown
InChI: InChI=1S/C15H14N2O/c18-10-9-16-15-11-5-1-3-7-13(11)17-14-8-4-2-6-12(14)15/h1-8,16,18H,9-10H2
charge 0 multiplicity 1
32 atoms
O  -1.594136 -4.247323 -0.141196
N  -1.013643 -1.605683 -0.457088
N  1.235473 1.980225 0.29541
C  -0.308729 -0.424697 -0.260235
C  -0.952888 0.860801 -0.169108
C  1.133629 -0.471937 -0.164377
C  -0.127993 2.021097 0.158173
C  1.849924 0.768811 0.098434
C  -2.327507 -1.973523 0.092554
C  -2.34779 1.080155 -0.451891
C  1.892746 -1.686861 -0.283144
C  -0.765998 3.303425 0.313467
C  3.286469 0.734526 0.187391
C  -2.923418 2.343502 -0.330276
C  3.284552 -1.683813 -0.191887
C  -2.206938 -3.316989 0.828212
C  -2.129339 3.463485 0.087636
C  3.990516 -0.456773 0.038808
H  -0.488054 -2.431035 -0.756719
H  -3.086926 -2.07229 -0.709203
H  -2.673099 -1.206139 0.804935
H  -2.962021 0.256146 -0.824847
H  1.388343 -2.648277 -0.440429
H  -0.119864 4.142465 0.589666
H  3.789784 1.687703 0.376787
H  -3.982012 2.487792 -0.572793
H  3.841898 -2.622051 -0.288366
H  -3.213321 -3.666402 1.136708
H  -1.560859 -3.205137 1.723081
H  -2.595364 4.449095 0.19791
H  5.084137 -0.46452 0.106339
H  -1.452372 -5.132878 0.273949
