program: Gaussian 09
title: 000145848
version: EM64L-G09RevD.01
frameworkgroup: C1[X(C19H22N4O2)]
method: RPBEPBE
basis: SDD
operation: Freq
keyword: #p
keyword: freq=noraman
keyword: PBEPBE/SDD
title: #p freq=noraman PBEPBE/SDD
converged: YES YES NO NO
title: Mulliken charges:
elementType: O O N N N N C C C C C C C C C C C C C C C C C C C H H H H H H H H H H H H H H H H H H H H H H
charge: -0.225711 -0.203931 -0.358785 -0.080388 -0.055232 -0.015248 -0.372100 -0.372392 -0.442158 0.305110 -0.361261 0.154781 0.238335 -0.080995 -0.084329 0.285260 -0.352203 -0.321634 -0.314272 -0.393338 -0.621032 -0.616640 -0.226318 -0.282110 -0.229059 0.255915 0.177065 0.200159 0.223627 0.236849 0.255869 0.202021 0.188407 0.289118 0.197871 0.274801 0.267355 0.277709 0.189404 0.232236 0.217258 0.223181 0.220977 0.186887 0.242992 0.231132 0.234814
chargesum: 0.00000
title: Mulliken charges with hydrogens summed into heavy atoms:
elementType: O O N N N N C C C C C C C C C C C C C C C C C C C
charge: -0.225711 -0.203931 -0.069666 -0.080388 -0.055232 -0.015248 0.060881 0.051394 0.050560 0.305110 0.029167 0.154781 0.238335 -0.080995 -0.084329 0.285260 -0.154332 -0.046833 -0.046917 -0.115629 0.017867 0.014405 0.016674 -0.050977 0.005755
polarizability: 3.67229922e+02 -3.94463188e+01 3.17825170e+02 -2.19852748e+01 -1.96638264e+01 1.40952409e+02
1716.lowfreq: -7.0121 -5.1484 -3.5221 -0.0001 0.0003 0.0007 10.8687 19.2083 26.3799
frequency: 10.4151 19.1292 26.3543 49.7982 67.7908 78.3808 90.8350 99.0874 106.0477 126.0775 146.2078 156.2542 169.1411 182.4658 219.3430 221.8174 230.7784 255.2027 271.7654 291.3039 304.7820 327.6439 338.9332 355.6486 374.1274 390.3573 423.1924 434.7866 457.4728 476.3050 486.8895 500.1023 532.0197 556.7900 587.5116 593.8407 610.5510 628.9198 640.4567 650.4575 685.3604 698.8538 724.7318 750.6985 757.5690 775.5565 780.8502 799.2735 811.8836 818.7296 836.0914 860.6941 908.0272 918.7252 924.9213 947.0916 953.0474 989.2615 991.5282 999.8800 1019.7266 1028.5548 1033.2354 1056.3733 1059.2346 1072.2214 1081.4611 1094.0144 1104.5068 1117.3586 1137.3615 1143.5341 1159.2835 1165.3489 1171.7612 1198.2961 1203.7182 1219.4911 1236.5360 1246.1955 1263.9183 1274.5798 1283.2030 1287.0346 1295.1324 1303.2633 1327.2939 1340.1918 1348.5356 1361.6040 1370.9961 1376.9021 1397.5669 1419.1930 1428.3305 1430.7369 1441.8621 1446.2755 1459.6793 1462.6331 1467.4092 1471.8079 1474.6697 1478.0198 1482.8927 1487.2237 1498.9856 1518.7116 1521.9683 1551.4781 1556.1603 1599.6516 1621.9370 2828.2472 2844.8652 2861.3794 2950.2296 2959.8970 2983.1761 2997.9263 3016.1344 3030.6053 3034.6368 3058.6931 3075.2169 3089.7671 3103.2250 3105.2566 3138.3031 3151.3029 3156.9537 3171.5482 3172.8082 3183.0689 3532.8166
redmass: 2.9123 3.9953 4.7901 6.3136 4.1305 4.2049 3.1576 2.6840 3.4679 4.7543 3.3954 3.2696 6.1942 4.8939 2.1165 1.4979 1.3394 2.7000 2.2860 5.0725 5.4051 6.8966 2.4176 5.1648 2.8552 3.5446 5.2616 3.5742 2.7517 4.0077 3.7898 3.5451 3.1085 3.8511 4.9548 3.8793 3.6888 4.5289 5.1635 3.8330 7.5645 7.6351 2.9310 1.1010 1.4250 3.9442 2.7969 1.4289 3.9607 1.9673 5.9096 1.6560 3.0678 1.6988 1.4719 1.4759 4.8748 1.3572 1.3318 3.1072 3.4687 2.1695 1.5940 3.1843 2.9360 1.9137 1.7927 1.6281 1.5373 2.1111 2.7588 1.6504 1.3094 1.5592 1.3555 2.5975 2.9491 1.7945 1.8276 1.5739 2.4081 2.1904 1.3841 1.1460 2.4874 1.1910 1.6689 2.2016 6.2671 1.5341 2.8012 1.4249 4.6760 1.1435 3.3985 2.4314 1.1601 2.7097 1.0549 1.0690 2.6191 1.0609 1.0729 1.0635 1.0779 1.0792 1.1877 5.0139 5.5395 5.7341 2.3209 5.8507 6.3288 1.0692 1.0578 1.0577 1.0730 1.0650 1.0595 1.0870 1.0717 1.0731 1.0951 1.1010 1.1010 1.0998 1.0902 1.0876 1.0878 1.0871 1.0940 1.0930 1.0995 1.0984 1.0743
irintensity: 0.3868 0.4285 0.1489 1.2531 1.0250 1.4213 0.3917 1.3340 2.3998 5.6050 0.1453 0.2130 3.8353 1.8525 0.2743 1.8198 1.0587 0.8402 1.6218 3.9105 1.0023 1.5904 8.7978 0.6598 0.5110 9.3705 1.3991 4.0478 7.2476 0.8392 3.4863 3.5199 3.4755 1.9736 9.0156 6.3090 2.3477 10.9334 23.4013 40.3257 18.7292 3.5053 13.7611 13.1964 84.1137 8.9851 19.3162 3.0300 15.9278 46.6004 2.0254 6.1812 5.1576 2.0873 1.3781 2.1026 3.3627 1.1808 0.6912 6.5116 15.2478 5.7005 16.8455 11.4535 24.7572 7.7674 5.9761 4.0752 6.7980 16.0600 11.7343 3.6118 1.5004 8.5936 6.7103 110.9899 255.5337 26.5953 26.2697 0.4937 7.7843 6.9453 11.1681 4.6724 12.3547 9.8567 43.1542 11.4341 77.9211 43.7360 31.6758 15.8252 34.2050 1.8760 8.8529 41.9491 3.9269 3.1119 9.8284 11.7324 2.1322 7.7506 9.0237 11.0558 6.6964 20.1470 78.2521 126.3272 70.7112 160.0047 77.0015 14.4152 14.4577 64.5311 75.6885 213.0797 38.5373 24.2133 26.9109 25.2412 48.6914 43.4420 7.7797 41.0742 37.7343 51.1166 9.6728 11.3660 9.9895 6.0798 18.4843 9.2070 25.8531 5.8223 26.8413
temp: 298.150 k
press: 1.00000 atm
elementType: 8 8 7 7 7 7 6 6 6 6 6 6 6 6 6 6 6 6 6 6 6 6 6 6 6 1 1 1 1 1 1 1 1 1 1 1 1 1 1 1 1 1 1 1 1 1 1
symmnumber: 1
zpe: 995687.0 jmol-1
zpe.correction: 0.379237 hartree
zpe.thermalcorrener: 0.402606 hartree
zpe.thermalcorrenthalpy: 0.403550 hartree
zpe.thermalcorrgfe: 0.323946 hartree
zpe.sumelectzpe: -1104.751994 hartree
zpe.sumelectthermal: -1104.728625 hartree
zpe.sumelectthermalent: -1104.727681 hartree
zpe.sumelectthermalfe: -1104.807285 hartree
dipole: -0.0061 -2.1599 -1.3955
dipole: 2.5715
quadrupole: -146.8730 -125.4070 -158.8573
quadrupole: -1.3425 -0.8255 -4.4810
quadrupole: -3.1606 18.3054 -15.1448 -1.3425 -0.8255 -4.4810
hfenergy: -1105.1312313 hartree
pointgroup: C01 [X(C19H22N4O2)]
dipole: -0.1529006 0.9247819 0.3806922 debye
polarizability: 352.0021472|49.9218589|320.1890733|18.2461247|-49.2649382|153.8162807 unknown
InChI: InChI=1S/C19H22N4O2/c1-22(2)13-6-5-12-20-19-14-8-3-4-9-15(14)21-16-10-7-11-17(18(16)19)23(24)25/h3-4,7-11,20H,5-6,12-13H2,1-2H3
charge 0 multiplicity 1
47 atoms
O  -1.585449 -2.499916 -0.486195
O  -0.610973 -0.951543 -1.856247
N  -0.218122 1.315374 -0.080773
N  -6.393795 -0.094966 0.504417
N  3.815192 0.154019 0.568516
N  -0.603277 -1.712064 -0.810214
C  -2.689714 0.84985 -0.198448
C  -3.89026 0.244103 0.562718
C  -1.396761 0.786473 0.641335
C  1.072126 0.836976 -0.099087
C  -5.202113 0.388613 -0.235373
C  1.443893 -0.535862 0.159772
C  2.157799 1.773507 -0.343541
C  2.817979 -0.778848 0.604667
C  3.507996 1.374275 0.013556
C  0.606859 -1.706401 0.043168
C  1.95494 3.088275 -0.878346
C  3.16943 -2.075488 1.128578
C  4.582998 2.310788 -0.168634
C  0.978534 -2.959933 0.537061
C  -6.406748 -1.561847 0.688504
C  -7.650824 0.380264 -0.110835
C  2.262885 -3.131346 1.134367
C  3.022454 3.9700 -1.061136
C  4.350648 3.578993 -0.695616
H  -2.52815 0.312433 -1.150971
H  -2.907955 1.909105 -0.453886
H  -4.026317 0.742952 1.542943
H  -3.676732 -0.823692 0.761396
H  -1.534101 1.387595 1.566353
H  -1.201496 -0.242647 0.975463
H  -5.36403 1.46297 -0.454234
H  -5.089375 -0.130117 -1.224803
H  -0.329451 2.289942 -0.366854
H  0.959873 3.415831 -1.205937
H  4.194022 -2.18741 1.495484
H  5.584188 1.974909 0.117484
H  0.298135 -3.804517 0.398795
H  -6.432607 -2.123485 -0.280622
H  -5.514707 -1.889557 1.247501
H  -7.296845 -1.849461 1.276246
H  -7.648026 1.484057 -0.160464
H  -8.509504 0.068769 0.510989
H  -7.81759 -0.012502 -1.147111
H  2.548555 -4.111034 1.529225
H  2.845279 4.960618 -1.493006
H  5.181235 4.278744 -0.837704
