program: Gaussian 09
title: 000145770
version: EM64L-G09RevD.01
frameworkgroup: C1[X(C14H28N2S2)]
method: RPBEPBE
basis: SDD
operation: Freq
keyword: #p
keyword: freq=noraman
keyword: PBEPBE/SDD
title: #p freq=noraman PBEPBE/SDD
converged: YES YES NO NO
title: Mulliken charges:
elementType: S S N N C C C C C C C C C C C C C C H H H H H H H H H H H H H H H H H H H H H H H H H H H H
charge: 0.014800 0.014791 -0.075544 -0.075535 -0.373379 -0.357564 -0.357600 -0.373389 -0.387107 -0.391943 -0.391931 -0.387121 -0.398718 -0.398717 -0.281697 -0.281726 -0.673659 -0.673636 0.214203 0.170135 0.173457 0.202717 0.202722 0.173456 0.170133 0.214213 0.205858 0.193259 0.191868 0.206788 0.206786 0.191869 0.193263 0.205860 0.215199 0.189288 0.215200 0.189285 0.198037 0.221048 0.198024 0.221090 0.260379 0.282588 0.260357 0.282596
chargesum: 0.00000
title: Mulliken charges with hydrogens summed into heavy atoms:
elementType: S S N N C C C C C C C C C C C C C C
charge: 0.014800 0.014791 -0.075544 -0.075535 0.010959 0.018609 0.018577 0.010957 0.012010 0.006713 0.006725 0.012002 0.005769 0.005768 0.137387 0.137387 -0.130692 -0.130683
polarizability: 2.74568380e+02 3.49417104e-03 1.92927900e+02 7.05631969e+00 5.76451161e-03 1.55288822e+02
1716.lowfreq: -4.3055 -1.1304 -0.9725 0.0012 0.0016 0.0025 7.8374 26.0908 26.3184
frequency: 7.4124 25.2300 25.8186 41.4061 46.6405 57.0696 84.3603 91.5458 98.3016 124.8561 140.6543 166.7954 218.1713 222.0944 226.1826 240.8836 243.8737 308.9138 309.3310 364.8137 368.3377 395.4486 397.4764 424.6864 440.4682 449.1704 449.2499 452.9455 551.7774 551.7877 684.1003 686.4872 762.5380 764.1461 779.4429 780.2126 805.7339 805.8155 852.1690 852.1884 856.0414 856.1203 904.3602 904.4124 958.6538 958.7015 989.3072 989.5726 992.9013 995.5800 1036.6064 1037.8629 1049.9875 1050.4002 1073.0033 1073.9840 1100.4003 1100.7544 1120.0607 1120.2259 1149.3650 1149.5126 1155.3059 1155.6606 1159.9381 1160.8149 1223.1533 1225.8524 1250.2561 1256.2774 1259.8514 1259.9329 1266.2069 1266.2271 1287.0740 1287.3214 1297.0108 1297.0393 1329.1893 1329.2610 1340.6464 1340.9818 1342.0928 1342.1790 1350.0705 1350.1069 1365.7215 1365.9213 1388.6854 1388.8839 1447.0782 1448.4484 1452.5561 1452.5968 1461.4435 1461.5078 1463.5940 1463.6836 1466.9652 1467.1827 1473.6177 1473.6258 1483.0710 1483.1415 2821.2961 2821.3548 2830.6344 2830.7840 2869.0430 2869.2199 2967.9608 2967.9826 2986.4423 2986.4995 2986.9165 2986.9508 3023.1189 3023.1417 3027.7412 3027.7701 3032.5633 3032.7533 3037.7912 3037.7961 3044.9517 3045.0633 3047.2507 3047.2614 3056.1506 3056.2015 3126.7747 3127.0628
redmass: 4.7081 3.0629 2.7881 3.7024 3.7266 3.8146 4.7140 2.5225 2.7929 3.1462 3.8186 5.0186 2.9625 2.7644 5.7552 1.9286 2.0731 2.1021 2.1078 2.6238 2.4288 2.1115 2.1836 6.1988 3.3437 2.9105 2.9126 5.0868 1.8082 1.8264 5.2243 5.1740 3.3731 3.5067 1.1874 1.1996 1.4518 1.4534 2.4858 2.4844 1.5056 1.5097 2.3059 2.3066 1.3048 1.3049 2.5981 2.6069 1.3776 1.3937 3.1275 3.0507 2.2563 2.2921 1.4985 1.4884 2.1607 2.1685 2.5432 2.5516 1.3165 1.3155 1.8466 1.8432 1.4147 1.4197 1.3851 1.3742 1.4649 1.4578 1.2620 1.2655 1.1745 1.1752 1.2601 1.2508 1.3463 1.3484 1.2672 1.2680 1.3781 1.3725 1.4454 1.4522 1.4710 1.4710 1.3836 1.3820 1.4011 1.3988 1.0833 1.0840 1.0896 1.0896 1.0871 1.0872 1.0845 1.0843 1.0875 1.0871 1.0904 1.0907 1.0954 1.0953 1.0715 1.0715 1.0701 1.0700 1.0698 1.0697 1.0627 1.0627 1.0621 1.0621 1.0604 1.0604 1.0886 1.0886 1.0872 1.0873 1.0908 1.0905 1.0901 1.0904 1.0610 1.0603 1.1019 1.1021 1.1035 1.1034 1.1088 1.1087
irintensity: 0.0234 0.2842 0.2403 0.5229 0.0053 0.3355 0.5190 2.7818 0.0249 0.0291 0.4547 1.8106 4.5258 0.6065 0.3495 0.9748 0.2547 5.0860 3.0050 1.8387 11.2160 0.9229 9.9477 0.4923 1.4266 0.2738 0.2363 0.0008 0.6540 0.1564 15.8319 1.7803 23.0785 10.7902 1.7911 5.6374 0.5582 0.4100 5.2367 4.1437 10.6366 6.2075 2.5166 3.5052 5.2319 1.5630 16.4590 14.3577 6.0923 0.3081 17.9051 7.6561 7.1984 2.3475 65.8709 0.0273 48.7519 19.6206 6.2003 4.9736 1.7303 9.9837 29.9798 6.1928 15.3773 8.0124 10.8827 4.7423 15.0329 0.1619 1.3018 3.2395 5.8133 5.5240 3.7105 1.4851 18.8235 6.2232 9.4480 0.0579 5.3093 1.1784 0.8831 2.4547 1.5298 0.7671 3.3381 0.8522 1.5721 0.1099 22.9156 0.0260 5.4705 9.7064 1.3477 26.1018 6.9599 4.1337 4.5169 12.5967 0.2991 7.9501 17.2835 2.4068 45.6719 43.5865 241.6426 23.7920 7.6449 197.2200 41.1603 36.0080 20.6780 33.9777 68.6993 11.1218 14.6577 6.9795 82.5816 43.6925 145.7747 18.7413 10.9069 12.1742 35.1090 22.6845 13.7085 10.2602 16.6152 179.9670 16.5657 15.2672
temp: 298.150 k
press: 1.00000 atm
elementType: 16 16 7 7 6 6 6 6 6 6 6 6 6 6 6 6 6 6 1 1 1 1 1 1 1 1 1 1 1 1 1 1 1 1 1 1 1 1 1 1 1 1 1 1 1 1
symmnumber: 1
zpe: 1064826.0 jmol-1
zpe.correction: 0.405571 hartree
zpe.thermalcorrener: 0.426348 hartree
zpe.thermalcorrenthalpy: 0.427292 hartree
zpe.thermalcorrgfe: 0.351273 hartree
zpe.sumelectzpe: -1454.404614 hartree
zpe.sumelectthermal: -1454.383837 hartree
zpe.sumelectthermalent: -1454.382893 hartree
zpe.sumelectthermalfe: -1454.458912 hartree
dipole: 0.0008 3.2740 -0.0005
dipole: 3.2740
quadrupole: -110.0868 -134.4592 -130.2394
quadrupole: -0.0028 5.1923 0.0039
quadrupole: 14.8416 -9.5307 -5.3109 -0.0028 5.1923 0.0039
hfenergy: -1454.8101852 hartree
pointgroup: C01 [X(C14H28N2S2)]
dipole: 0.0002142 -1.2880778 0.002418 debye
polarizability: 274.4280182|-0.0237799|192.9278116|-8.1555914|-0.0584001|155.429273 unknown
InChI: InChI=1S/C14H28N2S2/c1-3-7-15(8-4-1)11-13-17-18-14-12-16-9-5-2-6-10-16/h1-14H2
charge 0 multiplicity 1
46 atoms
S  -0.901221 2.789528 0.681824
S  0.901218 2.786335 -0.693595
N  -4.102165 0.196121 0.063056
N  4.101855 0.19526 -0.064349
C  -5.51136 0.303838 0.52478
C  -3.59565 -1.194382 0.200263
C  3.595533 -1.195615 -0.198523
C  5.511453 0.301898 -0.525139
C  -6.430159 -0.633062 -0.286285
C  -4.451707 -2.179226 -0.621746
C  4.450941 -2.178371 0.62665
C  6.42961 -0.63299 0.288964
C  -5.936214 -2.095629 -0.200281
C  5.935776 -2.095777 0.206135
C  -3.212541 1.197408 0.701432
C  3.212751 1.194816 -0.706178
C  -1.994182 1.497369 -0.195635
C  1.993625 1.497247 0.189014
H  -5.837663 1.353379 0.401297
H  -5.601639 0.050448 1.615134
H  -3.599609 -1.513377 1.277442
H  -2.547248 -1.230824 -0.1470
H  2.546828 -1.231223 0.147916
H  3.600424 -1.517274 -1.274906
H  5.602649 0.045839 -1.614789
H  5.837618 1.351748 -0.403944
H  -6.427703 -0.302746 -1.343006
H  -7.467227 -0.546843 0.09153
H  -4.063602 -3.206903 -0.483677
H  -4.355165 -1.923953 -1.694648
H  4.353547 -1.920405 1.698831
H  4.062972 -3.206402 0.490852
H  7.466978 -0.547661 -0.088229
H  6.42631 -0.300092 1.344873
H  -6.558434 -2.753426 -0.83607
H  -6.042851 -2.458412 0.843341
H  6.557522 -2.752015 0.843995
H  6.043202 -2.461085 -0.836524
H  -2.866591 0.871404 1.714596
H  -3.790349 2.130617 0.840878
H  2.867691 0.865963 -1.71873
H  3.79061 2.12767 -0.847739
H  -1.375216 0.601702 -0.363093
H  -2.317111 1.909035 -1.16324
H  1.37481 0.601922 0.358897
H  2.315682 1.912143 1.155526
