program: Gaussian 09
title: 000145746
version: EM64L-G09RevD.01
frameworkgroup: C1[X(C2H7NO3S)]
method: RPBEPBE
basis: SDD
operation: Freq
keyword: #p
keyword: freq=noraman
keyword: PBEPBE/SDD
title: #p freq=noraman PBEPBE/SDD
converged: NO NO NO NO
title: Mulliken charges:
elementType: S O O O N C C H H H H H H H
charge: 1.164692 -0.412324 -0.502605 -0.502472 -0.740013 -0.225484 -0.655238 0.232620 0.233058 0.219260 0.234696 0.234823 0.359640 0.359347
chargesum: 0.00000
title: Mulliken charges with hydrogens summed into heavy atoms:
elementType: S O O O N C C
charge: 1.164692 -0.412324 -0.502605 -0.502472 -0.021026 0.240194 0.033541
polarizability: 8.34354774e+01 -3.67454599e+00 5.89198090e+01 -2.03315203e-02 3.19774926e-02 6.08610964e+01
1716.lowfreq: -12.1244 -7.2887 -0.0030 -0.0005 0.0001 13.6320 30.1058 47.9020 116.0760
frequency: 30.0865 47.6769 116.0648 174.5397 235.6641 239.5469 254.3399 303.1392 338.1976 345.9760 363.7781 456.8207 578.1327 723.9438 820.4656 823.7783 865.8874 927.3224 1009.8142 1090.6681 1099.5084 1135.1655 1245.7508 1346.5515 1390.6467 1455.6818 1478.6453 1489.9985 1538.7625 2994.4693 2998.4833 3061.9656 3095.2926 3112.9779 3468.4393 3647.7339
redmass: 4.6748 1.9598 3.6935 1.5092 1.1579 3.0080 4.0097 3.7805 3.5194 2.6321 4.6116 5.3571 8.1479 4.1915 1.0834 3.3101 9.5116 3.1665 2.7064 1.7567 2.2135 1.3965 1.1618 1.2617 1.2161 1.0399 1.0480 1.0824 1.0862 1.0496 1.0412 1.1092 1.0982 1.1024 1.0405 1.1062
irintensity: 1.0860 1.5501 25.5106 20.4310 1.2893 26.2589 13.6005 0.9984 100.4851 21.9631 44.2644 184.4277 156.2435 28.2280 5.6275 43.8346 148.6570 46.4662 45.2706 65.0924 40.7766 4.1085 0.1328 4.6110 15.6294 13.8387 8.9781 16.1865 27.6220 24.2807 27.1501 10.8463 23.0207 33.8756 63.7255 55.3655
temp: 298.150 k
press: 1.00000 atm
elementType: 16 8 8 8 7 6 6 1 1 1 1 1 1 1
symmnumber: 1
zpe: 265008.2 jmol-1
zpe.correction: 0.100936 hartree
zpe.thermalcorrener: 0.110731 hartree
zpe.thermalcorrenthalpy: 0.111676 hartree
zpe.thermalcorrgfe: 0.065113 hartree
zpe.sumelectzpe: -758.106041 hartree
zpe.sumelectthermal: -758.096246 hartree
zpe.sumelectthermalent: -758.095301 hartree
zpe.sumelectthermalfe: -758.141864 hartree
dipole: 2.5445 3.2993 -0.0482
dipole: 4.1668
quadrupole: -47.0409 -46.5972 -53.9870
quadrupole: -8.9416 0.0847 -0.1047
quadrupole: 2.1675 2.6112 -4.7786 -8.9416 0.0847 -0.1047
hfenergy: -758.206977 hartree
pointgroup: C01 [X(C2H7N1O3S1)]
dipole: 0.9916552 -1.3022534 0.0908807 debye
dipolederiv: 2.1672958 0.1742472 -0.0089497 0.008619 1.7508988 -0.0206259 0.0017667 -0.0188298 1.4537708 -1.1433698 -0.1504874 0.0066476 -0.0803694 -0.5356999 0.0039701 0.0012434 0.0036212 -0.4643241 -0.600409 0.0169967 0.0280443 0.0741245 -0.5169528 -0.0083958 0.0952595 -0.1242976 -0.6140249 -0.599852 0.0131413 -0.0308946 0.0604669 -0.5017103 -0.0063653 -0.1046498 0.1095342 -0.6298615 -0.9893976 -0.0858935 0.0061587 -0.2428225 -0.8552235 0.0284275 0.0162165 0.0279823 -0.4121063 0.5647006 0.1072629 -0.0049921 0.6429071 0.3175745 0.0013056 -0.0353616 -0.0004303 0.3115412 -0.1930631 0.0369954 -0.0025911 -0.2193601 0.0242958 0.0022061 0.0113002 0.0028866 0.0724156 -0.0071117 0.0194352 -0.0450323 -0.0842192 -0.0033325 0.074205 0.0079331 0.1135324 -0.0651457 -0.0074803 0.0248931 0.0427907 -0.0841329 -0.0240924 -0.0791111 0.0014219 -0.1174305 -0.043201 -0.1285555 -0.0966652 0.0045936 -0.0721506 0.0042655 0.0061262 0.0034356 0.0060705 0.1221642 0.1200301 0.0040881 0.0128777 0.050478 0.0307965 0.0990189 -0.0256413 0.1092729 -0.0664249 0.1196576 0.0033079 -0.0124243 0.0536852 0.007459 -0.1066055 0.0210655 -0.1172294 -0.0429207 0.349144 -0.0291142 0.0715942 -0.0460801 0.1543084 -0.0115726 0.1233423 0.0702566 0.1854789 0.3484108 -0.0382075 -0.0678226 -0.061146 0.1474128 0.017417 -0.1173321 -0.0649391 0.1926383 unknown
polarizability: 83.4867824|3.4973894|58.8782109|-0.0954642|0.1473707|60.8513896 unknown
InChI: InChI=1S/C2H7NO3S/c1-2-6-7(3,4)5/h2-3H2,1H3
charge 0 multiplicity 1
14 atoms
S  -1.060131 0.134474 -0.014049
O  0.652496 -0.587284 0.033324
O  -1.312824 0.963153 1.345753
O  -1.314096 0.77749 -1.470412
N  -1.968317 -1.361811 0.082914
C  1.735053 0.439876 -0.020744
C  3.038991 -0.359242 0.025869
H  1.644522 1.017455 -0.959481
H  1.640042 1.116809 0.848552
H  3.897604 0.336042 -0.009368
H  3.105083 -0.949708 0.955017
H  3.109615 -1.046137 -0.834055
H  -1.934718 -1.935669 -0.764621
H  -1.93052 -1.825448 0.995302
