program: Gaussian 09
title: 000145821
version: EM64L-G09RevD.01
frameworkgroup: C1[X(C18H39O2P)]
method: RPBEPBE
basis: SDD
operation: Freq
keyword: #p
keyword: freq=noraman
keyword: PBEPBE/SDD
title: #p freq=noraman PBEPBE/SDD
converged: YES YES NO NO
title: Mulliken charges:
elementType: P O O C C C C C C C C C C C C C C C C C C H H H H H H H H H H H H H H H H H H H H H H H H H H H H H H H H H H H H H H H
charge: 1.187564 -0.504454 -0.646248 0.065622 0.039569 -0.860094 -0.835008 -0.447034 -0.438740 -0.405764 -0.399839 -0.372744 -0.373845 -0.717072 -0.716947 -0.345490 -0.346700 -0.219177 -0.698178 -0.697738 -0.659721 0.222216 0.194900 0.271794 0.242941 0.282475 0.241543 0.183839 0.211923 0.209757 0.189176 0.272236 0.185493 0.275840 0.189799 0.205287 0.202837 0.205878 0.204913 0.218070 0.219368 0.209051 0.210732 0.222504 0.211208 0.195731 0.190166 0.195596 0.190473 0.194994 0.199232 0.211603 0.216982 0.207775 0.211998 0.217016 0.208407 0.200478 0.234471 0.233339
chargesum: 0.00000
title: Mulliken charges with hydrogens summed into heavy atoms:
elementType: P O O C C C C C C C C C C C C C C C C C C
charge: 1.187564 -0.504454 -0.646248 0.287838 0.234470 -0.345359 -0.310991 -0.051271 -0.039807 0.051965 0.065799 0.035379 0.036946 -0.070583 -0.072503 0.040407 0.039368 0.175049 -0.061818 -0.060317 0.008567
polarizability: 2.56448685e+02 -3.06070361e+00 2.13500191e+02 -1.62288162e+00 -5.66026099e+00 2.19612868e+02
1716.lowfreq: -21.4905 -8.0851 -0.0011 -0.0009 -0.0006 1.8340 5.7901 9.0038 17.3615
frequency: -19.3395 4.8108 17.3285 25.8067 29.4336 29.8983 41.4335 44.4605 54.6693 61.8080 75.6490 78.0903 103.6061 114.2380 117.6132 131.0886 144.6391 146.3259 156.8450 187.6538 193.6903 208.2922 210.6931 222.9939 227.3940 230.4424 247.4148 248.2650 264.0974 282.6019 286.5892 323.8532 332.9347 347.5378 365.9661 381.4561 388.8497 400.9452 465.6865 474.0994 523.9793 561.7392 623.8024 690.0985 712.3708 726.3123 728.7972 762.9794 768.8790 775.6854 778.8192 801.2661 804.8114 815.5720 858.9504 867.1674 886.3164 896.6601 898.3874 906.9453 909.1763 948.5059 949.6678 1002.2812 1004.7332 1006.9586 1025.0608 1028.6076 1030.0669 1046.4178 1048.1929 1055.2180 1055.5132 1070.0640 1073.2249 1094.4377 1099.3477 1104.5670 1122.5191 1128.3971 1131.1120 1153.8925 1158.4016 1190.5082 1191.6822 1217.7124 1218.0294 1227.3400 1231.6643 1245.9453 1251.5958 1258.2021 1269.4601 1270.8630 1281.6208 1284.4320 1292.5785 1292.7998 1311.1800 1314.2085 1326.6580 1333.8938 1342.3410 1345.1285 1354.8729 1360.1576 1363.2145 1366.3582 1368.9063 1384.6043 1388.3211 1389.1155 1389.8232 1390.8359 1417.7122 1424.5444 1455.4740 1457.8406 1460.8693 1464.4762 1465.5948 1474.3379 1475.3090 1476.5325 1477.1640 1477.6393 1477.7076 1478.3529 1481.8524 1484.3123 1485.5604 1488.4755 1488.8696 1489.1541 1495.5357 2930.2917 2937.9653 2944.6248 2958.5798 2959.7458 2960.3539 2960.7551 2967.2006 2968.6764 2971.7428 2972.1001 2972.2479 2972.5392 2973.0558 2976.4905 2987.3699 2992.8903 2993.3063 2994.0661 2998.2619 2998.6757 3011.8588 3013.2487 3028.1775 3029.0551 3036.9060 3037.7432 3059.5159 3065.6820 3066.1734 3066.4780 3068.3361 3068.9967 3071.7562 3071.9987 3072.0609 3072.8414 3091.0129 3108.8196
redmass: 2.4273 3.2857 3.7042 2.9482 3.0917 2.6408 1.9474 2.0435 1.8952 2.3145 2.8888 2.8916 2.6458 2.7841 3.1768 3.4886 2.5670 1.9408 2.3239 4.6393 3.2822 2.1722 1.6608 1.5621 1.3831 1.1202 1.8063 1.3487 2.3985 2.1445 2.0928 3.5989 3.0638 2.9070 2.7503 3.1799 2.8602 2.9855 2.6519 3.1371 3.1677 3.3085 4.6214 2.8152 1.9647 1.1291 1.2263 1.9010 1.8542 1.3309 1.4418 1.3583 1.4045 1.1052 1.8949 1.8050 3.1166 1.7083 1.6994 1.4214 1.4051 1.8165 1.9071 2.7087 2.4808 2.6867 2.7333 1.9275 1.9270 1.6775 1.7034 2.4390 2.5956 1.8689 2.1237 1.5710 1.7897 2.0976 2.1237 1.4190 2.0638 2.0106 1.9718 1.6649 1.5912 1.3734 1.3785 1.2858 1.2755 1.3356 1.2790 1.1823 1.2723 1.2728 1.1603 1.1542 1.0644 1.0666 1.2910 1.3290 1.3647 1.3395 1.4559 1.4540 1.2699 1.5014 1.5232 1.3776 1.3843 1.2114 1.2153 1.2170 1.2193 1.2360 1.0811 1.0851 1.0405 1.0723 1.0700 1.0692 1.0683 1.0648 1.0641 1.0517 1.0429 1.0440 1.0440 1.0453 1.0578 1.0588 1.0814 1.0773 1.0750 1.0766 1.0840 1.0793 1.0543 1.0718 1.0602 1.0585 1.0703 1.0642 1.0607 1.0597 1.0466 1.0372 1.0382 1.0366 1.0548 1.0616 1.0692 1.0586 1.0366 1.0965 1.0940 1.0952 1.0982 1.0993 1.0996 1.0997 1.1030 1.1034 1.1015 1.1016 1.1002 1.1005 1.1006 1.1006 1.0993 1.0987 1.0993 1.0985 1.0983 1.1013
irintensity: 0.0887 0.1168 0.0365 0.7682 0.7910 0.0909 2.3874 1.1898 0.0736 0.5577 0.0523 1.8449 0.4087 0.0286 1.2328 2.8438 2.7151 1.6306 2.8048 1.3354 5.7310 3.5538 2.0516 1.3099 0.5073 0.0497 0.6661 2.2387 2.2102 1.5138 0.8646 7.0709 12.1345 2.0478 20.1736 6.8036 0.5439 18.2054 6.6379 2.4598 1.6508 53.0734 61.5131 30.5522 20.2917 7.6384 3.0092 4.5723 19.6439 2.5683 14.9039 1.7653 6.2761 2.7157 5.5723 15.2907 93.8130 11.4777 15.1299 0.8518 0.4736 11.3819 3.5185 64.9754 37.8983 34.1334 74.9633 5.3312 3.2524 6.4381 5.3077 0.2230 0.1823 2.7355 4.0628 3.6898 4.9965 4.6601 0.2114 5.4524 13.0333 7.9243 6.2461 3.8240 7.4667 7.6651 2.8718 13.4636 9.7243 1.6306 1.1135 1.5619 3.2058 5.1308 4.3539 3.3940 0.3512 0.4141 0.2104 0.2858 0.6456 0.7029 3.0021 2.1273 5.7256 1.1196 2.2801 12.3852 16.1255 15.2126 14.7070 9.9149 10.2406 21.7340 5.1117 15.9492 9.7447 5.0404 3.6412 0.2365 0.6407 4.1119 5.4813 6.2178 13.5799 4.3175 16.3796 3.9030 5.7115 3.6752 26.8751 11.1147 14.8813 5.2428 11.5393 21.3506 40.0212 6.9469 1.4243 3.8236 14.6378 12.0404 50.6283 62.2036 22.9554 8.1848 78.9933 26.9945 77.4152 52.1742 18.6968 21.8210 28.4693 50.8998 9.5979 6.7357 6.6328 3.4500 7.7525 7.9637 71.2241 76.0114 10.2194 5.1884 53.0307 54.1554 93.1307 92.9336 41.7654 51.7834 55.3107 34.6951 30.0417 31.2846
temp: 298.150 k
press: 1.00000 atm
elementType: 15 8 8 6 6 6 6 6 6 6 6 6 6 6 6 6 6 6 6 6 6 1 1 1 1 1 1 1 1 1 1 1 1 1 1 1 1 1 1 1 1 1 1 1 1 1 1 1 1 1 1 1 1 1 1 1 1 1 1 1
symmnumber: 1
zpe: 1412120.3 jmol-1
zpe.correction: 0.537848 hartree
zpe.thermalcorrener: 0.566924 hartree
zpe.thermalcorrenthalpy: 0.567869 hartree
zpe.thermalcorrgfe: 0.472471 hartree
zpe.sumelectzpe: -1199.202153 hartree
zpe.sumelectthermal: -1199.173077 hartree
zpe.sumelectthermalent: -1199.172133 hartree
zpe.sumelectthermalfe: -1199.267530 hartree
dipole: 0.2915 -2.7958 -4.7325
dipole: 5.5044
quadrupole: -136.8646 -150.3866 -147.3530
quadrupole: -0.2057 0.6537 -10.8507
quadrupole: 8.0035 -5.5186 -2.4849 -0.2057 0.6537 -10.8507
hfenergy: -1199.7400014 hartree
pointgroup: C01 [X(C18H39O2P1)]
dipole: 0.1270463 1.4617434 1.5927831 debye
polarizability: 256.5154819|2.8080576|211.3884272|1.0137589|-3.9287786|221.6578348 unknown
InChI: InChI=1S/C18H39O2P/c1-6-11-13-17(8-3)15-21(19,20-10-5)16-18(9-4)14-12-7-2/h17-18H,6-16H2,1-5H3
charge 0 multiplicity 1
60 atoms
P  0.052756 -1.264959 -0.255213
O  -0.24779 -2.48829 0.9900
O  0.014964 -1.967813 -1.695334
C  -2.726833 -0.528055 -0.189202
C  2.278399 0.481514 -0.845608
C  -1.293335 0.028606 0.038086
C  1.708864 -0.494814 0.224001
C  -3.768251 0.312684 0.606124
C  3.321824 1.439737 -0.197246
C  -3.034936 -0.64396 -1.709202
C  2.822545 -0.303105 -2.073358
C  -3.890828 1.797494 0.192714
C  4.574015 0.759554 0.403759
C  -4.370387 -1.352687 -2.020757
C  3.256744 0.600236 -3.247189
C  -4.920036 2.568811 1.051028
C  5.562017 1.778331 1.018738
C  -0.330007 -2.125491 2.421055
C  -5.051554 4.053116 0.647313
C  6.812315 1.10976 1.629641
C  -0.618912 -3.42258 3.177111
H  -2.761113 -1.557008 0.231318
H  1.448572 1.127878 -1.211578
H  -1.079991 0.872471 -0.64436
H  -1.166762 0.393589 1.07588
H  2.402237 -1.337794 0.400332
H  1.552579 0.027719 1.188076
H  -3.51229 0.263467 1.686616
H  -4.761913 -0.168451 0.508514
H  3.647422 2.175411 -0.959525
H  2.817888 2.027457 0.599394
H  -2.205572 -1.202718 -2.183187
H  -3.035201 0.368488 -2.162831
H  2.032677 -0.998698 -2.415674
H  3.675329 -0.935132 -1.752744
H  -4.186345 1.869072 -0.87331
H  -2.90415 2.298415 0.277959
H  5.099543 0.17566 -0.378409
H  4.274945 0.033727 1.187512
H  -4.391098 -2.364611 -1.5738
H  -4.504791 -1.468297 -3.111763
H  -5.243073 -0.793169 -1.63522
H  2.423965 1.252561 -3.573136
H  3.559079 -0.011375 -4.11664
H  4.11216 1.249811 -2.984087
H  -5.908198 2.071929 0.965827
H  -4.62981 2.49849 2.119702
H  5.871313 2.501781 0.236898
H  5.038068 2.369638 1.797895
H  -1.143063 -1.386282 2.585356
H  0.62755 -1.677144 2.760679
H  -5.370263 4.150055 -0.40774
H  -5.794481 4.579803 1.274127
H  -4.084675 4.580664 0.754078
H  7.37409 0.544168 0.86257
H  7.498718 1.856988 2.06855
H  6.530245 0.39863 2.429173
H  -0.694736 -3.229668 4.263679
H  0.18715 -4.154765 3.001651
H  -1.56708 -3.86485 2.827653
