program: Gaussian 09
title: 000145745
version: EM64L-G09RevD.01
frameworkgroup: C1[X(C8H13NO)]
method: RPBEPBE
basis: SDD
operation: Freq
keyword: #p
keyword: freq=noraman
keyword: PBEPBE/SDD
title: #p freq=noraman PBEPBE/SDD
converged: YES YES NO NO
title: Mulliken charges:
elementType: O N C C C C C C C C H H H H H H H H H H H H H
charge: -0.212064 -0.263131 -0.180595 -0.180595 -0.396142 -0.396143 -0.435847 -0.512672 -0.512672 0.177443 0.227427 0.227427 0.198453 0.214092 0.214091 0.198453 0.218043 0.237529 0.250843 0.221004 0.242025 0.242025 0.221004
chargesum: 0.00000
title: Mulliken charges with hydrogens summed into heavy atoms:
elementType: O N C C C C C C C C
charge: -0.212064 -0.012287 0.046832 0.046832 0.016403 0.016402 0.019725 -0.049643 -0.049643 0.177443
polarizability: 9.14998934e+01 6.37053800e-06 8.87017620e+01 3.58754198e+00 1.07544751e-05 8.47512166e+01
1716.lowfreq: -0.0005 -0.0004 0.0005 10.7006 16.2819 28.5505 99.6662 132.2158 244.4969
frequency: 99.6654 132.1765 244.4826 329.1082 351.7017 378.2833 381.5426 438.0880 460.0361 489.1611 564.5842 641.6510 661.6908 722.8097 765.6193 767.0110 818.5012 830.4568 882.2888 882.3494 938.3766 940.4661 951.7176 1024.5351 1061.3713 1074.7240 1082.6132 1105.5493 1124.8657 1157.3117 1196.7143 1207.0429 1211.8625 1239.0397 1246.6511 1276.4533 1289.4795 1325.5966 1334.4663 1335.9731 1349.8908 1354.2980 1375.5822 1424.4168 1435.2482 1444.6972 1455.2741 1460.0624 1487.0600 1616.0677 2964.2618 2969.0650 2985.9841 2989.6292 2996.2520 3016.8502 3020.5395 3036.0489 3048.7386 3056.6505 3058.0923 3063.3901 3427.1813
redmass: 5.5289 2.6570 2.2567 1.8608 2.9365 2.0055 3.8584 2.7546 3.9188 2.1629 2.0245 5.5054 1.9819 3.4224 2.9178 2.2326 1.6753 2.9912 1.9567 1.6582 2.0439 2.2998 1.9738 3.6702 2.1645 1.6054 1.6263 2.0314 1.0968 1.4049 1.1761 1.4776 2.5314 1.4400 1.5237 1.3207 1.3274 1.5710 1.5438 1.3499 1.4650 1.4090 1.4857 1.1120 1.0876 1.1963 1.1811 1.0847 1.0847 9.2682 1.0644 1.0648 1.0600 1.0611 1.0646 1.0843 1.0872 1.0995 1.1024 1.0984 1.0966 1.1011 1.0747
irintensity: 5.1535 0.6801 1.4928 0.1907 3.9575 1.7500 0.2059 21.7721 9.3310 5.4357 17.0572 2.0743 165.1884 6.2882 6.0698 3.3081 0.0206 9.4037 21.6152 2.0154 2.2352 1.6778 7.6157 6.4939 1.5823 2.3888 28.5755 5.0421 6.4792 2.7488 9.7294 0.8528 73.1809 16.2359 1.9163 17.6122 4.7237 2.0238 19.6897 0.6776 6.1975 3.1964 0.9514 21.3392 20.7617 11.0108 3.7082 5.2240 15.9823 168.2710 1.3297 23.1295 10.3276 23.3291 43.5672 107.7895 31.7815 21.0485 2.3693 18.7215 37.4247 71.2455 3.0691
temp: 298.150 k
press: 1.00000 atm
elementType: 8 7 6 6 6 6 6 6 6 6 1 1 1 1 1 1 1 1 1 1 1 1 1
symmnumber: 1
zpe: 526364.7 jmol-1
zpe.correction: 0.200482 hartree
zpe.thermalcorrener: 0.208889 hartree
zpe.thermalcorrenthalpy: 0.209833 hartree
zpe.thermalcorrgfe: 0.167701 hartree
zpe.sumelectzpe: -441.832490 hartree
zpe.sumelectthermal: -441.824083 hartree
zpe.sumelectthermalent: -441.823138 hartree
zpe.sumelectthermalfe: -441.865271 hartree
dipole: 1.8695 0.0000 2.3406
dipole: 2.9956
quadrupole: -72.0165 -56.5243 -59.0543
quadrupole: -0.0001 -8.4214 -0.0001
quadrupole: -9.4848 6.0074 3.4774 -0.0001 -8.4214 -0.0001
hfenergy: -442.0329718 hartree
pointgroup: C01 [X(C8H13N1O1)]
dipole: -0.7193494 -0.0001546 -0.9335624 debye
dipolederiv: -0.7548778 -0.0000442 -0.2742702 -0.0000834 -0.4863491 -0.0000213 -0.4925276 -0.000017 -0.6325248 -0.7664937 -0.0000499 -0.3094055 -0.0000351 -0.491145 0.0000304 -0.224072 0.0000276 -0.3567714 0.5775431 0.0219989 0.1012155 -0.0808715 0.3559296 -0.132191 0.108437 -0.1395755 0.2828259 0.5775462 -0.0219714 0.1012284 0.0809021 0.3560223 0.1321618 0.1084123 0.1395465 0.2827279 0.0704459 0.0150534 0.044874 0.0030075 0.0774903 -0.0185743 0.0037915 -0.0116976 0.0199233 0.0704468 -0.015039 0.0448789 -0.0030063 0.0775004 0.0185529 0.0037925 0.0116777 0.0199147 0.0969869 0.0000026 0.0232701 0.0000078 0.0275153 0.0000015 0.0564445 0.0000006 0.0350356 -0.2879567 -0.060515 -0.1857707 -0.1953991 -0.2749817 -0.146006 -0.1341757 -0.1172383 -0.0461121 -0.2879477 0.0604504 -0.185787 0.1953519 -0.2748964 0.1460938 -0.1342386 0.1173246 -0.0462047 0.6301426 0.0000801 0.4253015 0.0001151 0.8617304 -0.0000528 0.6178964 -0.000057 0.6058298 0.0014607 -0.0421006 -0.0329009 -0.0393692 -0.1172969 -0.1009556 -0.0316707 -0.1292048 -0.0489051 0.0014623 0.0420864 -0.0329134 0.0393544 -0.1172188 0.1009799 -0.0316801 0.1292294 -0.0489844 0.0723206 0.0765294 -0.0330649 0.0253973 -0.141199 0.0929941 -0.0022161 0.1015146 -0.0117142 -0.1727982 -0.0555456 -0.0318689 0.0103018 0.0689452 -0.0221539 -0.0469077 -0.0407986 0.0381053 -0.1727973 0.0555436 -0.0318863 -0.010309 0.068965 0.0221444 -0.0469016 0.0407897 0.0380831 0.0723168 -0.0765487 -0.0330416 -0.0254063 -0.1412616 -0.0929475 -0.002211 -0.1014697 -0.0116475 -0.0419005 0.0000299 0.160555 0.0000247 0.0498349 -0.0000296 0.1290419 -0.0000286 -0.0966911 -0.1028892 -0.0000178 -0.1168541 -0.0000121 0.0124469 0.0000104 -0.085175 0.0000098 0.0592402 0.2380685 0.000048 0.2910641 0.0000188 0.0650952 -0.0000098 0.1241831 -0.0000065 0.0403517 0.0500531 -0.0052114 0.0861982 -0.014993 0.0767497 0.0026601 0.1029889 -0.0369393 -0.0781388 0.0394081 0.0420004 -0.0485156 0.0277642 -0.0652856 0.0647437 -0.0631007 0.129463 0.0168697 0.0394053 -0.0420224 -0.048503 -0.027791 -0.0653522 -0.0647124 -0.0630956 -0.1294311 0.0169392 0.0500542 0.0052428 0.0861962 0.0150305 0.0767612 -0.0027188 0.1029843 0.0368805 -0.0781523 unknown
polarizability: 91.3727265|0.0006293|88.7017619|3.7030385|-0.0007466|84.8783837 unknown
InChI: InChI=1S/C8H13NO/c10-8-4-6-2-1-3-7(5-8)9-6/h6-7,9H,1-5H2
charge 0 multiplicity 1
23 atoms
O  2.436041 0.000149 1.075832
N  -0.918272 -0.000236 -1.436674
C  -0.549615 -1.228633 -0.690182
C  -0.549571 1.22841 -0.690613
C  -1.390413 -1.279138 0.611022
C  -1.390363 1.279394 0.610579
C  -1.22065 0.000272 1.469241
C  0.998488 -1.295177 -0.418561
C  0.998535 1.294995 -0.419022
C  1.555374 0.000003 0.170488
H  -0.822071 -2.099864 -1.314932
H  -0.822004 2.099431 -1.315665
H  -1.118718 -2.176461 1.199073
H  -2.45112 -1.38213 0.313274
H  -2.451067 1.382323 0.312799
H  -1.118634 2.176909 1.19832
H  -1.964637 0.000433 2.288197
H  -0.229064 0.000337 1.960455
H  -0.551947 -0.000412 -2.398953
H  1.502478 -1.465811 -1.393522
H  1.270062 -2.135754 0.245126
H  1.270142 2.135798 0.244364
H  1.502527 1.465262 -1.394045
