program: Gaussian 09
title: 000145748
version: EM64L-G09RevD.01
frameworkgroup: C1[X(C10H13NO)]
method: RPBEPBE
basis: SDD
operation: Freq
keyword: #p
keyword: freq=noraman
keyword: PBEPBE/SDD
title: #p freq=noraman PBEPBE/SDD
converged: YES YES NO NO
title: Mulliken charges:
elementType: O N C C C C C C C C C C H H H H H H H H H H H H H
charge: -0.279980 -0.638056 0.154510 0.369164 0.359551 0.355486 -0.613271 -0.585063 -0.832713 -0.836098 -0.835407 0.130399 0.279204 0.211726 0.234617 0.239775 0.242761 0.229525 0.229214 0.241386 0.231420 0.232655 0.228344 0.317973 0.332877
chargesum: 0.00000
title: Mulliken charges with hydrogens summed into heavy atoms:
elementType: O N C C C C C C C C C C
charge: -0.279980 0.012794 0.154510 0.369164 0.359551 0.355486 -0.334067 -0.373337 -0.115560 -0.135973 -0.142987 0.130399
polarizability: 1.60708747e+02 1.05393578e+00 1.34756421e+02 -4.21972857e-01 -1.82389623e+00 6.32624990e+01
1716.lowfreq: -40.8820 -7.2103 -4.0658 -0.0006 -0.0001 0.0008 11.9649 39.2224 95.0656
frequency: -40.3061 39.1301 95.0652 147.6128 165.7601 171.5154 179.9169 232.4659 288.7656 298.8648 345.9209 347.9701 390.5310 467.6391 496.9969 506.1703 521.0274 538.7143 551.4411 602.2153 608.5482 712.2561 721.8711 749.2587 879.4221 908.5970 921.4684 933.8032 998.5963 1001.6411 1018.2175 1045.1003 1050.8144 1057.6274 1080.8834 1123.6676 1206.6641 1258.3531 1274.2744 1361.6836 1374.0439 1393.2375 1399.2388 1405.7573 1414.9761 1441.8023 1459.1516 1472.9346 1480.3798 1483.2703 1486.6600 1499.5570 1568.4253 1595.2869 1616.8010 1632.2209 2970.8717 2971.7109 2972.6825 3046.8485 3047.4521 3058.3192 3080.6002 3088.6382 3097.0053 3110.0647 3146.9583 3529.1026 3683.3371
redmass: 1.0560 4.7148 3.0869 3.1655 2.1377 1.4467 1.0948 2.5829 2.8964 3.3331 4.0704 2.5699 3.8493 1.3048 3.5994 2.2580 2.8799 4.0809 2.9069 1.5257 3.6001 3.4135 3.8522 2.9067 1.5169 2.5375 5.1552 1.4697 1.5275 1.3709 1.4155 1.5476 1.8699 1.7235 2.0208 1.9567 2.9388 1.5495 2.5581 5.1616 5.7341 1.2655 1.3502 1.1942 2.9355 1.5539 1.0817 1.0502 1.1219 1.0768 1.4303 1.2370 3.4392 2.7066 5.5109 2.3720 1.0432 1.0385 1.0388 1.0965 1.0966 1.0886 1.0987 1.0982 1.0987 1.0905 1.0918 1.0447 1.1039
irintensity: 0.2030 13.2962 0.5537 2.6275 4.3830 2.4323 0.6539 0.4325 2.1865 3.7903 0.7879 0.2704 6.6268 85.4616 15.0397 80.2663 7.9358 3.5270 12.0365 71.7321 16.1593 1.7875 8.3736 31.8756 10.2888 0.5948 0.8093 9.6777 9.3174 6.7243 22.1008 0.3754 0.0532 6.0420 4.6705 10.2453 2.0329 16.4468 21.6024 265.6769 8.1126 0.4096 19.0293 17.1549 10.7020 7.5040 3.2126 32.5109 20.4116 3.2416 11.0733 6.8855 142.5111 76.6082 22.4062 192.6310 42.1225 39.5221 11.8650 35.0379 17.4920 12.1457 23.4492 24.4214 8.9272 23.8034 1.6155 33.9981 27.9226
temp: 298.150 k
press: 1.00000 atm
elementType: 8 7 6 6 6 6 6 6 6 6 6 6 1 1 1 1 1 1 1 1 1 1 1 1 1
symmnumber: 1
zpe: 543270.9 jmol-1
zpe.correction: 0.206921 hartree
zpe.thermalcorrener: 0.218740 hartree
zpe.thermalcorrenthalpy: 0.219685 hartree
zpe.thermalcorrgfe: 0.169291 hartree
zpe.sumelectzpe: -517.981743 hartree
zpe.sumelectthermal: -517.969923 hartree
zpe.sumelectthermalent: -517.968979 hartree
zpe.sumelectthermalfe: -518.019373 hartree
dipole: -2.8271 3.4960 -0.9958
dipole: 4.6050
quadrupole: -68.1237 -65.7307 -74.9459
quadrupole: 13.1959 -3.8886 -0.0805
quadrupole: 1.4764 3.8694 -5.3458 13.1959 -3.8886 -0.0805
hfenergy: -518.1886637 hartree
pointgroup: C01 [X(C10H13N1O1)]
dipole: 1.1168348 -1.364094 -0.417637 debye
dipolederiv: -0.9348453 0.2660907 0.0677822 0.1689017 -0.8466764 -0.1464125 0.0177604 -0.1305595 -0.4113065 -0.7641871 -0.4388709 -0.1423458 -0.4630024 -0.841916 -0.009719 -0.1485031 0.0099282 -0.6811935 0.3826692 -0.008559 0.0030299 0.0353869 -0.1688663 0.0023785 0.0583629 0.0037022 -0.0757673 -0.0370286 0.233787 -0.0068561 0.2648636 0.2609114 -0.0071917 -0.0150079 -0.0234763 -0.0360781 -0.1261941 -0.1784721 0.0079384 -0.2922257 0.2368607 -0.0076253 -0.0026885 0.0013612 -0.0213101 -0.5809353 -0.0273259 0.0054277 0.0542175 0.0189792 -0.0255508 0.0373058 -0.0156366 0.030011 -0.0371426 -0.1536388 0.0007193 0.0632948 -0.0863314 -0.009748 0.0176537 0.0209072 -0.1522373 0.0190129 0.1242674 -0.0119256 -0.0691162 -0.0894754 -0.0142486 -0.0703912 -0.0242512 -0.1993527 -0.2013531 0.0018659 0.0015821 0.0036574 0.0441853 0.0028014 -0.0947909 0.0028505 0.0644977 -0.0152681 -0.1323386 0.0033611 -0.0821958 -0.0793566 0.0085219 0.0041679 0.0290686 0.0705794 -0.0026481 0.1267549 -0.0065472 0.0814754 -0.0629245 -0.0023476 0.0013356 -0.0171534 0.0672189 1.753064 0.1441818 0.0382941 0.2240852 1.28098 0.3183302 0.0841447 0.2718051 0.3066145 0.1135746 0.0602675 -0.0021104 0.044155 -0.0051067 0.0052116 -0.014257 -0.008712 0.148773 0.0212007 -0.0988987 0.004705 -0.1157936 -0.0809177 0.0155256 0.0203258 0.0132718 0.1409415 0.0304971 0.0441634 0.0162291 0.1114087 -0.050448 -0.09946 0.0724389 -0.0833541 0.0502517 0.0336668 -0.0460295 0.0186218 -0.1125779 -0.0438284 0.0967751 0.0731495 0.079745 0.0507399 -0.0280812 0.0007542 -0.0522466 0.0024838 0.1077619 0.0016368 -0.1059275 0.0011799 -0.0872301 -0.0229344 -0.0625246 -0.1161063 -0.0279577 0.0431114 0.021575 -0.1273449 -0.0393266 -0.0268345 0.0103271 -0.0664974 0.1086554 -0.0352781 0.0396284 -0.0093486 0.1214607 0.0475579 -0.0644599 -0.0022189 0.1693348 0.0128874 0.0530861 -0.0440059 -0.0096208 0.0102458 -0.0195257 0.1070064 0.0093714 0.071575 0.104058 0.0439348 0.0351806 0.0021875 0.118782 -0.0563951 -0.0606648 -0.0212425 0.0585767 -0.1178121 0.0215969 0.0438052 -0.023596 -0.1275998 0.0391019 -0.0261186 -0.0149371 -0.178691 0.0239671 -0.0561416 -0.0537987 0.0202714 0.0135447 0.027391 0.1020589 0.2353923 0.0703762 0.0307511 0.0690478 0.1515863 -0.0724531 0.0426562 -0.0756096 0.3423921 0.18024 0.019851 0.0079406 0.0126934 0.1906615 -0.0578931 0.0131762 -0.0538705 0.3614683 unknown
polarizability: 160.6870325|1.267238|134.7370264|-0.8314238|2.41239|63.3036083 unknown
InChI: InChI=1S/C10H13NO/c1-6-4-9(10(11)12)5-7(2)8(6)3/h4-5H,11H2,1-3H3
charge 0 multiplicity 1
25 atoms
O  -3.185665 1.161287 0.375347
N  -3.291255 -1.077085 -0.199383
C  1.775072 -0.035728 -0.012816
C  1.06285 1.203576 -0.013779
C  1.048843 -1.264473 0.048344
C  -1.077983 -0.015948 0.061059
C  -0.348657 1.194443 0.025912
C  -0.364956 -1.239201 0.08277
C  3.29455 -0.04781 -0.033428
C  1.797082 2.534086 -0.051146
C  1.77168 -2.6015 0.089271
C  -2.580784 0.078771 0.097813
H  -0.915698 2.131635 0.036537
H  -0.8954 -2.19644 0.166732
H  3.6921 -0.941637 -0.543122
H  3.70486 0.840893 -0.54081
H  3.705685 -0.052268 0.99644
H  2.528215 2.623424 0.774134
H  2.359368 2.666198 -0.995915
H  1.087998 3.374231 0.033887
H  2.334591 -2.791964 -0.845067
H  2.501813 -2.64848 0.918744
H  1.058681 -3.433076 0.222422
H  -2.845609 -1.931617 -0.52415
H  -4.308783 -1.028116 -0.167495
