program: Gaussian 09
title: 000145741
version: EM64L-G09RevD.01
frameworkgroup: C1[X(C17H14N2)]
method: RPBEPBE
basis: SDD
operation: Freq
keyword: #pfreq=noraman
keyword: PBEPBE/SDD
title: #p freq=noraman PBEPBE/SDD
converged: NO YES NO YES
title: Mulliken charges:
elementType: N N C C C C C C C C C C C C C C C C C H H H H H H H H H H H H H H
charge: -0.471345 -0.036023 0.178570 0.201564 0.151151 0.216867 0.339115 -0.611271 -0.592734 0.342153 0.394093 -0.067024 -0.534303 -0.386704 -0.827421 -0.822362 -0.313882 -0.259333 -0.232868 0.313112 0.242633 0.239108 0.247407 0.208656 0.224021 0.224008 0.232922 0.229173 0.227188 0.227191 0.260299 0.226451 0.229588
chargesum: 0.00000
title: Mulliken charges with hydrogens summed into heavy atoms:
elementType: N N C C C C C C C C C C C C C C C C C
charge: -0.158232 -0.036023 0.178570 0.201564 0.151151 0.216867 0.339115 -0.368638 -0.353626 0.342153 0.394093 -0.067024 -0.286896 -0.178048 -0.146471 -0.138809 -0.053583 -0.032882 -0.003280
polarizability: 3.82535861e+02 7.16943177e+00 1.97636746e+02 4.19808905e-03 3.11128737e-03 8.43827400e+01
1716.lowfreq: -0.0010 0.0001 0.0009 0.7093 1.2042 11.5250 53.2252 80.0187 122.6261
frequency: 53.1653 80.0015 122.6246 126.7142 133.2968 160.9463 189.5514 230.3746 252.0060 260.6088 299.3630 327.8160 349.9704 377.2949 416.1566 426.3992 448.3548 485.6305 507.8134 519.2866 527.9784 529.7983 578.5157 593.1349 606.5039 644.8673 667.4413 701.0840 725.7889 762.5172 766.8132 768.5940 801.4496 804.6342 857.2428 865.5410 872.1712 892.3955 896.1608 930.2912 955.7641 991.3262 997.6967 1004.8681 1017.3647 1031.4828 1034.4847 1053.1581 1089.9297 1132.1232 1163.8513 1181.4029 1191.0847 1209.8799 1241.6714 1261.8499 1274.9751 1297.4595 1324.9099 1359.6125 1374.0336 1394.7651 1395.5607 1409.3273 1414.4359 1431.8718 1443.6839 1458.5347 1460.9572 1473.3099 1477.3678 1484.1901 1496.1737 1514.6469 1560.1242 1573.5192 1590.3904 1629.7617 1646.0584 2967.7019 2968.9472 3038.1077 3041.6697 3080.6097 3083.3085 3106.7822 3114.0507 3126.3104 3132.5799 3134.1012 3153.2808 3169.2816 3609.6784
redmass: 4.8020 3.6431 4.5391 1.1162 3.3642 2.6309 1.2188 3.8803 5.0117 3.7256 2.6409 4.1159 4.5706 4.4784 4.2823 2.8679 3.0091 5.7153 2.0089 6.1646 1.5484 6.3933 3.8153 3.8933 7.0141 4.0467 6.0726 4.2732 5.4741 2.2413 5.0000 1.7872 2.8854 5.9115 5.1060 1.4217 1.8137 4.2111 1.4415 1.5034 1.3853 1.3303 1.6435 1.5999 2.3030 1.4397 2.2951 1.6238 3.0336 2.6737 1.2481 1.7543 1.8941 3.3017 1.7160 2.0076 1.9829 1.7124 2.4615 5.8546 3.3732 3.0433 1.2424 1.3593 2.7778 3.4683 2.8330 1.6500 1.0468 2.5986 1.0452 1.2136 2.5440 4.7196 7.5676 7.5365 5.7971 7.0767 7.5341 1.0377 1.0379 1.0970 1.0968 1.0986 1.0977 1.0880 1.0913 1.0919 1.0920 1.0881 1.0943 1.0991 1.0801
irintensity: 0.7623 0.1685 0.2994 0.0002 0.0884 0.8204 0.6667 0.0046 0.8828 3.5063 0.0743 0.2659 0.0018 0.7158 0.6659 0.3547 12.6894 1.8086 26.9270 5.3997 75.3197 1.9276 4.6243 2.5711 1.4878 0.9568 1.4114 3.3308 2.9305 31.8234 5.0582 61.6788 0.0765 2.0693 10.5591 28.8297 1.4778 3.4391 10.3703 8.5770 4.0964 0.3983 21.8173 0.3165 16.7001 17.4025 2.8888 0.0565 4.3202 7.1248 3.8744 3.2206 8.0890 2.7193 46.9892 17.7606 11.7567 48.3877 4.0962 23.1589 26.1524 26.5794 6.5841 21.6222 3.6324 7.4365 15.0745 39.9217 0.5884 38.9107 30.4737 2.3917 21.4264 22.6206 31.1476 0.3123 21.9895 1.8848 14.1618 85.1063 27.2548 42.5379 2.3863 38.0935 3.4345 10.7539 13.7577 20.9652 9.2596 8.6675 24.5703 30.8013 40.6976
temp: 298.150 k
press: 1.00000 atm
elementType: 7 7 6 6 6 6 6 6 6 6 6 6 6 6 6 6 6 6 6 1 1 1 1 1 1 1 1 1 1 1 1 1 1
symmnumber: 1
zpe: 689828.5 jmol-1
zpe.correction: 0.262742 hartree
zpe.thermalcorrener: 0.277626 hartree
zpe.thermalcorrenthalpy: 0.278570 hartree
zpe.thermalcorrgfe: 0.221503 hartree
zpe.sumelectzpe: -764.463480 hartree
zpe.sumelectthermal: -764.448596 hartree
zpe.sumelectthermalent: -764.447652 hartree
zpe.sumelectthermalfe: -764.504719 hartree
dipole: 2.4377 -3.7973 -0.0002
dipole: 4.5124
quadrupole: -95.3817 -100.6657 -117.4260
quadrupole: 8.3531 0.0007 0.0008
quadrupole: 9.1095 3.8254 -12.9348 8.3531 0.0007 0.0008
hfenergy: -764.7262217 hartree
pointgroup: C01 [X(C17H14N2)]
dipole: -0.966406 1.4892478 -0.0000592 debye
polarizability: 382.4608949|8.0781422|197.7117127|-0.0041827|-0.0031319|84.38274 unknown
InChI: InChI=1S/C17H14N2/c1-10-7-13-14-9-18-15-6-4-3-5-12(15)17(14)19-16(13)8-11(10)2/h3-9,19H,1-2H3
charge 0 multiplicity 1
33 atoms
N  -0.116177 1.461554 0.000144
N  2.223968 -2.049102 0.000134
C  -1.307277 -0.511938 0.000189
C  0.115823 -0.820074 0.000169
C  0.816898 0.422904 0.000141
C  -1.418181 0.918427 0.000139
C  2.24672 0.468169 0.000114
C  -2.491207 -1.286321 0.00023
C  -2.667832 1.567155 0.000116
C  -3.755137 -0.65661 0.000168
C  -3.84345 0.781658 0.000115
C  2.905968 -0.828788 0.000109
C  0.877872 -2.026851 0.000174
C  3.036537 1.659535 0.000076
C  -5.02102 -1.497137 0.00021
C  -5.201364 1.461352 0.000092
C  4.335122 -0.866653 0.000073
C  4.433952 1.584816 0.000027
C  5.086615 0.313688 0.000038
H  0.102889 2.455025 0.000053
H  -2.435854 -2.380949 0.00024
H  -2.743017 2.660711 0.000066
H  0.37655 -3.002711 0.000187
H  2.549053 2.643044 0.000075
H  -5.649868 -1.291968 0.88832
H  -5.650149 -1.29168 -0.88763
H  -4.782143 -2.574196 0.0000
H  -5.10021 2.560061 -0.000023
H  -5.799501 1.176757 -0.88719
H  -5.799427 1.176937 0.887483
H  4.809681 -1.852892 0.000065
H  5.031864 2.502831 -0.000004
H  6.181201 0.266246 0.000001
