program: Gaussian 09
title: 000145740
version: EM64L-G09RevD.01
frameworkgroup: C1[X(C10H7N3O2S)]
method: RPBEPBE
basis: SDD
operation: Freq
keyword: #p
keyword: freq=noraman
keyword: PBEPBE/SDD
title: #p freq=noraman PBEPBE/SDD
converged: YES YES NO NO
title: Mulliken charges:
elementType: S O O N N N C C C C C C C C C C H H H H H H H
charge: 0.382224 -0.212782 -0.188165 0.056774 0.019928 0.087982 0.425193 -0.436400 -0.237147 -0.335254 -0.163252 -0.153747 -0.342577 -0.167198 -0.166804 -0.353334 0.296920 0.245598 0.259441 0.254347 0.245092 0.235552 0.247609
chargesum: 0.00000
title: Mulliken charges with hydrogens summed into heavy atoms:
elementType: S O O N N N C C C C C C C C C C
charge: 0.382224 -0.212782 -0.188165 0.056774 0.019928 0.087982 0.425193 -0.436400 0.059773 -0.335254 0.082345 0.105694 -0.088230 0.077894 0.068749 -0.105725
polarizability: 2.40514387e+02 3.55497177e+00 1.47028095e+02 -4.72816105e+00 4.52219083e+00 9.42101185e+01
1716.lowfreq: -7.6824 -3.7979 -0.0024 -0.0013 -0.0010 3.2632 18.5480 37.4235 56.7853
frequency: 18.2883 37.4149 56.7792 87.4851 110.7761 160.2825 192.9196 214.3748 287.0166 295.5196 350.8815 404.2186 409.9619 432.7643 434.7832 487.7577 501.8279 538.3715 605.9033 629.2344 675.4952 695.6162 703.7275 742.2450 748.6438 779.3705 797.6326 817.7708 902.5023 952.6969 955.1007 961.3727 993.7216 1004.4342 1014.9230 1032.9184 1045.1180 1071.9031 1094.2699 1120.7427 1141.2385 1162.5267 1202.3138 1221.5320 1277.8171 1314.7339 1327.9331 1352.8801 1391.2664 1404.6207 1413.2966 1430.2286 1535.8949 1558.1336 1563.2999 1570.2589 3136.2897 3141.2856 3147.6404 3166.8288 3170.4416 3178.8217 3188.3348
redmass: 6.7576 5.8704 5.8446 11.8480 5.5392 11.4865 5.3092 5.8884 8.3194 7.6370 10.6032 3.4113 15.8127 5.7189 5.5292 3.6170 5.5445 5.9529 7.5115 8.1183 7.7522 7.9003 8.3881 3.2455 2.3352 1.7164 9.5277 1.5370 1.2883 6.6027 1.4095 1.4391 1.3712 1.3552 5.5317 3.0381 3.2365 1.9996 2.1234 2.3308 2.0114 1.0743 4.3685 2.3970 1.5094 8.5211 7.7995 6.1245 2.3925 1.9516 2.0768 1.9536 6.1990 5.5389 5.9802 6.6409 1.0877 1.0902 1.0907 1.0958 1.0910 1.1010 1.0996
irintensity: 1.4167 1.4289 0.7601 0.5884 2.5490 4.9693 0.7987 0.0674 2.7601 2.1992 2.4793 5.6913 3.3086 1.7848 2.8261 6.7265 4.7007 14.2027 2.1961 3.1459 5.1963 32.2802 2.5359 21.4554 25.5845 57.8853 22.6096 36.7109 0.3934 5.4653 0.3423 1.0209 1.8715 0.1202 2.1525 15.6649 41.7098 19.5889 58.2365 2.0170 15.5599 0.9818 218.0372 80.6490 1.5720 12.9250 72.1256 49.4630 125.2875 17.0631 73.5639 46.3385 93.6424 38.9571 20.5265 60.4429 7.1975 11.7544 11.2930 26.3550 6.6051 12.8129 8.2230
temp: 298.150 k
press: 1.00000 atm
elementType: 16 8 8 7 7 7 6 6 6 6 6 6 6 6 6 6 1 1 1 1 1 1 1
symmnumber: 1
zpe: 408909.8 jmol-1
zpe.correction: 0.155746 hartree
zpe.thermalcorrener: 0.169079 hartree
zpe.thermalcorrenthalpy: 0.170023 hartree
zpe.thermalcorrgfe: 0.113253 hartree
zpe.sumelectzpe: -1096.797112 hartree
zpe.sumelectthermal: -1096.783779 hartree
zpe.sumelectthermalent: -1096.782835 hartree
zpe.sumelectthermalfe: -1096.839605 hartree
dipole: 3.8977 5.2842 -1.9844
dipole: 6.8595
quadrupole: -88.4778 -96.4181 -96.7870
quadrupole: -11.8882 -1.9830 2.2224
quadrupole: 5.4166 -2.5238 -2.8927 -11.8882 -1.9830 2.2224
hfenergy: -1096.9528579 hartree
pointgroup: C01 [X(C10H7N3O2S1)]
dipole: -1.2975866 2.3659366 -0.0415542 debye
dipolederiv: -0.2253801 -0.2976955 0.0535153 -0.5956759 -0.0154675 -0.011809 0.2719097 0.0069018 -0.0006455 -1.2028147 0.2049407 -0.0259896 0.1609585 -0.4364537 0.0599217 0.0440714 0.0480697 -0.2453073 -0.5284523 -0.0206934 0.0253107 0.0296021 -0.624523 0.155413 0.0298448 0.1465926 -0.259743 -0.3532649 0.0122893 -0.0017713 -0.6921568 -0.794542 0.1454661 0.2095319 0.1625076 -0.1785034 1.5253493 -0.3069633 0.0112118 -0.576138 1.1620789 -0.3210752 0.0207706 -0.2905882 0.2854561 -0.5483238 0.0545429 -0.069899 0.1605436 -0.1975932 -0.0093025 -0.4207845 -0.0185327 -0.4649312 -0.5491844 -0.1052733 0.0361391 0.3765483 -0.5298408 0.1666221 -0.1195416 0.1789798 0.0254075 0.7098912 0.3223122 -0.0828115 0.9487381 0.6333683 -0.0991124 -0.3274208 -0.1271683 0.0297893 -0.0096706 0.111359 -0.0362802 -0.228412 0.3529105 -0.1115545 0.0790059 -0.1330365 -0.0210406 1.1037797 -0.0821567 0.1656205 -0.2232191 -0.0489052 -0.0239515 0.3090212 0.0554396 0.2284408 -0.4242178 0.3056435 -0.0893629 0.236665 -0.2161597 0.0119647 -0.0448884 -0.0013643 -0.1410716 -0.5155172 0.05559 0.0272391 0.1856057 -0.0915259 0.0302177 -0.0387563 -0.0160712 0.0222923 0.6111201 -0.1784471 0.0410207 0.2383634 0.3963084 -0.1054181 -0.0697099 -0.1112569 0.0038226 0.1051299 -0.0977582 -0.0671735 -0.1420259 -0.054568 0.0484075 0.0510141 0.0315186 0.127848 0.0053604 -0.0706747 0.1081522 -0.0498476 -0.0724517 -0.0593789 -0.0786331 -0.021621 -0.2074822 0.0307354 -0.0865852 -0.0079214 -0.0485815 -0.0185245 0.040501 0.2345293 -0.0053996 0.3951058 0.0537188 -0.0094453 0.0027098 0.0353024 0.1438001 0.0047813 -0.0092501 0.0151419 0.1605567 0.0299046 -0.0844242 0.0249075 -0.0751195 -0.0088586 0.050579 0.0214773 0.0523865 0.1501584 0.137926 0.0334292 -0.0636887 0.020433 0.1286149 0.0000125 -0.0763499 -0.0071335 -0.0313547 0.070054 0.0715059 -0.0176103 0.0111693 -0.0604859 0.048186 -0.0155742 0.0570654 0.1167949 -0.0038197 0.0582616 0.0743708 0.0852213 0.114922 -0.0473565 0.0815846 -0.0483347 0.0071263 -0.0653722 0.0876152 -0.0589392 0.1097108 0.1167746 0.0254853 -0.0487077 0.0162831 0.0841782 0.0430485 0.0226272 -0.0487499 0.032315 0.121122 0.0014007 -0.1031442 0.0096202 -0.0868974 unknown
polarizability: 238.344256|-13.5156933|140.8794598|6.3364418|-20.4699411|102.5288849 unknown
InChI: InChI=1S/C10H7N3O2S/c14-13(15)8-4-3-7-12-10(8)16-9-5-1-2-6-11-9/h1-7H
charge 0 multiplicity 1
23 atoms
S  -0.310095 -1.424741 0.457742
O  4.207816 -1.578145 0.400081
O  2.156809 -2.463222 0.883856
N  0.306533 1.144024 -0.23221
N  2.919898 -1.493524 0.486807
N  -2.224585 -0.526689 -1.317868
C  2.272625 -0.225891 0.119183
C  0.85183 -0.063345 0.089527
C  3.112557 0.863295 -0.213621
C  -1.899644 -0.555025 -0.005175
C  2.531445 2.095067 -0.556181
C  -2.726198 -0.062089 1.027247
C  1.117162 2.185539 -0.542648
C  -3.968421 0.508017 0.664445
C  -4.322884 0.561263 -0.703083
C  -3.421611 0.034315 -1.657005
H  4.194477 0.707138 -0.192012
H  3.144409 2.96105 -0.818916
H  -2.40185 -0.116852 2.069779
H  0.609601 3.125539 -0.786181
H  -4.640158 0.903257 1.433454
H  -5.274138 0.994729 -1.027245
H  -3.655878 0.049489 -2.727177
