program: Gaussian 09
title: 000146023
version: EM64L-G09RevD.01
frameworkgroup: C1[X(C20H27N5O6S)]
method: RPBEPBE
basis: SDD
operation: Freq
keyword: #p
keyword: freq=noraman
keyword: PBEPBE/SDD
title: #p freq=noraman PBEPBE/SDD
converged: YES YES NO NO
title: Mulliken charges:
elementType: S O O O O O O N N N N N C C C C C C C C C C C C C C C C C C C C H H H H H H H H H H H H H H H H H H H H H H H H H H H
charge: 0.953987 -0.545644 -0.511731 -0.275788 -0.301407 -0.449659 -0.209110 -0.511112 -0.388059 -0.289096 -0.401004 -0.497811 -0.272751 -0.406616 0.015968 -0.280611 -0.720486 -0.741533 0.239564 0.477045 0.318913 -0.300210 0.232635 -0.456892 -0.403865 -0.261472 -0.377818 -0.239948 -0.386906 -0.639519 0.222126 0.180040 0.296905 0.222544 0.200351 0.246154 0.322926 0.214179 0.220150 0.201000 0.218037 0.191436 0.255975 0.303388 0.361235 0.294216 0.277103 0.245753 0.263112 0.239307 0.283965 0.282645 0.232650 0.229849 0.279747 0.343947 0.399360 0.300945 0.301888
chargesum: 0.00000
title: Mulliken charges with hydrogens summed into heavy atoms:
elementType: S O O O O O O N N N N N C C C C C C C C C C C C C C C C C C C C
charge: 0.953987 -0.545644 -0.511731 -0.275788 -0.301407 -0.050299 -0.209110 -0.188186 -0.026824 -0.289096 -0.057057 0.105022 0.024154 0.016279 0.262122 -0.280611 -0.085157 -0.076085 0.239564 0.477045 0.318913 0.003178 0.232635 -0.162677 -0.126761 -0.015720 -0.114706 -0.000640 0.179705 0.102727 0.222126 0.180040
chargesum: 0.00085
polarizability: 3.87610656e+02 -2.47809336e+01 2.88941911e+02 2.41212694e+01 2.62922985e+01 2.47727909e+02
1716.lowfreq: -15.4785 -11.5307 -8.6473 -5.4822 -1.1908 -0.6646 -0.0576 3.8657 7.8949
frequency: -10.0139 1.7469 5.9589 14.5220 25.5013 36.1355 37.9159 39.1489 53.1929 60.2172 61.3883 64.5603 91.2573 101.5212 109.6150 120.7572 125.6457 137.4612 146.4294 152.2816 172.1915 182.5061 190.6467 194.3351 209.5031 217.4155 225.8565 229.2404 233.8509 245.5880 249.0350 257.1807 279.4819 291.9525 307.2120 311.0840 336.0685 349.3208 377.7686 385.0647 401.4444 407.0524 428.5180 450.0915 467.6673 477.6856 491.6490 497.5500 507.4055 511.8734 528.4955 533.4744 543.2736 553.0241 560.6671 588.0947 606.8317 650.3185 664.7826 678.7093 686.2512 702.7344 713.7179 750.9066 752.6879 778.9640 783.1113 791.1212 809.9295 816.7753 821.8701 838.0495 840.3755 851.5068 860.1979 921.9295 932.0732 934.7282 939.8253 949.7950 950.5978 954.6513 963.5917 978.5451 996.5024 1000.5003 1002.3347 1012.4508 1052.5846 1062.9214 1075.0203 1077.7657 1094.9357 1098.9751 1125.2368 1128.3987 1137.4856 1151.0775 1165.9792 1178.3804 1192.7578 1197.8223 1212.1683 1214.2840 1219.6632 1243.2154 1253.7674 1259.5364 1272.8001 1283.9793 1291.8119 1300.1241 1302.5621 1322.7730 1329.1058 1336.8710 1346.5102 1356.8769 1379.8924 1384.0542 1387.6336 1398.7259 1400.5615 1412.7482 1427.5636 1450.1946 1452.4096 1453.3186 1456.5628 1467.3491 1473.7541 1478.5955 1482.0151 1485.9102 1489.5494 1497.2840 1501.2282 1571.9785 1592.0076 1600.8994 1611.8504 1625.5220 1686.9932 1687.1846 2962.0424 2964.2286 2967.6273 2971.3494 2991.2814 3005.9726 3012.4544 3030.9085 3035.4843 3049.8569 3054.5235 3064.5205 3070.9779 3074.2845 3107.6485 3138.0096 3142.1591 3149.0865 3153.8022 3166.6580 3169.5375 3302.0671 3393.5976 3507.4256 3534.0780 3542.3990 3564.5184
redmass: 5.6492 8.0426 5.0514 4.9649 5.5521 5.5176 7.4917 2.8321 4.4803 4.9763 4.9047 4.8831 5.6345 2.8169 4.2183 4.1918 1.1357 5.1045 4.3670 4.9572 3.6636 3.7972 1.2851 4.3365 1.6191 2.1415 3.2372 6.3827 2.2242 3.9854 2.3048 4.8345 3.6722 4.8542 4.3057 3.8093 4.9922 3.7236 6.0292 5.5925 3.0866 2.6528 4.3273 5.5410 3.2603 5.4693 2.0977 3.7579 4.2816 4.8724 1.6560 4.7123 4.0148 4.0991 3.4820 3.2803 1.1546 1.4608 6.4548 4.9329 4.3739 4.5485 6.4344 2.8958 1.9041 4.3736 2.2386 4.8307 4.6466 1.2750 3.0963 3.0670 4.0016 1.6376 2.7180 1.2396 2.0467 4.8577 2.2597 2.0603 1.4610 2.2686 2.0779 2.0317 1.3737 1.8143 1.4519 2.9875 2.7268 4.6458 2.0942 2.0778 2.8522 3.3623 1.2854 2.3569 2.0179 2.2143 1.2769 1.8009 1.4319 1.5722 1.1541 1.4279 1.3456 3.8928 1.8702 1.3689 1.3280 2.7358 1.1561 1.3219 2.0081 2.3817 1.5289 1.4890 1.3701 2.6265 1.2137 2.5699 1.4919 1.2297 2.4503 1.3370 3.3198 1.8034 1.1378 2.1067 1.0788 1.0577 1.0468 1.0477 1.0624 2.1048 1.1250 4.0326 1.0516 7.7480 5.5689 7.0921 7.2500 7.0948 1.1419 5.7859 1.0384 1.0499 1.0456 1.0341 1.0606 1.0841 1.0845 1.0992 1.0990 1.1024 1.0980 1.0980 1.0995 1.0987 1.0986 1.0876 1.0867 1.0928 1.0914 1.0993 1.0990 1.0733 1.0427 1.0991 1.0646 1.0783 1.0788
irintensity: 0.5735 0.1056 0.0500 0.1662 0.5940 0.4576 5.2010 0.4631 0.3642 1.6394 0.9087 8.6574 1.6143 0.6072 0.6330 0.6895 0.0976 5.7704 2.3425 0.7545 1.4704 5.1519 19.9731 0.5450 0.6074 3.6839 5.1210 3.7412 2.5332 0.4595 0.3620 2.7357 0.6922 25.0759 24.2592 1.2479 22.7290 31.5663 6.2319 25.5463 2.9331 7.1607 34.8900 56.2546 1.0996 8.9818 66.8653 20.8567 30.7001 7.7050 89.7187 20.4748 50.4488 22.8537 14.2558 0.7339 29.3819 201.5548 10.3899 9.8653 13.7485 6.2785 1.8619 13.4148 6.2296 20.1699 92.3780 27.2188 0.3036 89.6801 51.2717 0.4261 14.4107 14.3557 134.9960 6.9692 32.5649 17.5392 22.5159 0.7461 0.3824 10.0313 1.8848 0.8051 1.3918 21.9134 1.5742 29.6320 8.1934 2.3343 8.4916 232.8489 39.0798 20.4747 3.7783 13.2174 87.6632 19.0051 4.6538 31.3235 6.6055 3.4522 6.0653 12.5614 23.8971 5.7474 22.6326 5.4531 0.4051 53.8236 0.8514 22.6654 30.4458 104.5376 5.0674 8.6867 3.5229 53.6301 13.8163 6.0870 32.5089 26.5498 1.6088 19.3668 20.0136 249.1507 5.9438 42.2909 5.8390 2.1724 8.9897 14.6496 9.4981 295.5628 36.3655 29.5139 11.4970 19.4474 13.1548 130.3383 367.7854 7.3252 70.4479 200.7296 30.0030 12.3749 58.0783 57.6908 21.3672 4.6234 1.9172 3.9333 13.0873 29.9778 10.9072 66.9710 22.5956 69.3686 0.2562 9.1107 4.4252 0.7489 2.5282 14.2564 11.7327 35.3318 0.5816 1.1423 35.4608 82.9541 16.0609
temp: 298.150 k
press: 1.00000 atm
elementType: 16 8 8 8 8 8 8 7 7 7 7 7 6 6 6 6 6 6 6 6 6 6 6 6 6 6 6 6 6 6 6 6 1 1 1 1 1 1 1 1 1 1 1 1 1 1 1 1 1 1 1 1 1 1 1 1 1 1 1
symmnumber: 1
zpe: 1206927.8 jmol-1
zpe.correction: 0.459695 hartree
zpe.thermalcorrener: 0.493765 hartree
zpe.thermalcorrenthalpy: 0.494709 hartree
zpe.thermalcorrgfe: 0.386834 hartree
zpe.sumelectzpe: -1898.927485 hartree
zpe.sumelectthermal: -1898.893414 hartree
zpe.sumelectthermalent: -1898.892470 hartree
zpe.sumelectthermalfe: -1899.000346 hartree
dipole: 2.8802 4.2337 -1.1565
dipole: 5.2495
quadrupole: -199.8024 -213.9457 -194.0220
quadrupole: 27.7349 1.2581 22.9438
quadrupole: 2.7876 -11.3557 8.5680 27.7349 1.2581 22.9438
hfenergy: -1899.3871793 hartree
pointgroup: C01 [X(C20H27N5O6S1)]
dipole: 0.7377725 -1.9063785 -0.2949352 debye
polarizability: 390.77748|10.809664|257.9359782|-23.8972602|34.0730926|275.5670179 unknown
InChI: InChI=1S/C20H27N5O6S/c1-12(2)10-15(19(28)22-11-18(26)27)24-32(30,31)17-9-5-6-13-14(17)7-4-8-16(13)25(3)20(29)23-21/h4-9,12,15,22-24,26H,10-11,21H2,1-3H3
charge 0 multiplicity 1
59 atoms
S  1.91045 2.109234 -0.628858
O  2.582026 1.971075 -2.108943
O  1.911545 3.517328 0.173302
O  1.343215 -1.3518 0.8831
O  -6.575005 0.127998 0.523857
O  2.147088 -4.032377 -3.083578
O  0.354222 -5.329937 -2.359528
N  2.899984 0.9252 0.440349
N  2.077298 -2.349529 -1.077503
N  -4.275284 0.103231 1.027092
N  -5.368602 2.122485 0.425163
N  -6.490838 2.895099 0.038861
C  3.266485 -0.326525 -0.260996
C  4.601056 -0.857858 0.343077
C  5.7892 0.12927 0.213014
C  0.127544 1.421202 -0.783578
C  7.029203 -0.468281 0.91948
C  6.105981 0.474026 -1.261498
C  2.145676 -1.380994 -0.106331
C  -0.785351 1.470126 0.318887
C  -2.069113 0.820047 0.109084
C  -0.160469 0.848644 -2.015444
C  -3.023958 0.801787 1.192325
C  -0.513767 2.104616 1.576514
C  -2.368512 0.225756 -1.160597
C  -1.443211 0.24739 -2.204744
C  -2.716855 1.41357 2.412258
C  -1.465616 2.074711 2.597327
C  1.059591 -3.399677 -1.013671
C  -4.307694 -1.341053 1.332679
C  -5.47295 0.745807 0.654641
C  1.1167 -4.360855 -2.186959
H  3.429256 -0.078006 -1.327004
H  4.433054 -1.099675 1.411308
H  4.856063 -1.808983 -0.170204
H  5.498696 1.064118 0.729707
H  2.315694 0.713007 1.278807
H  6.819924 -0.697322 1.981516
H  7.878346 0.238659 0.887193
H  7.353594 -1.405933 0.426708
H  7.001995 1.118667 -1.321678
H  6.315536 -0.443384 -1.847909
H  5.278517 1.021705 -1.747854
H  0.584949 0.877208 -2.817349
H  2.707747 -2.347999 -1.882894
H  0.42484 2.650648 1.715514
H  -3.352524 -0.23359 -1.298331
H  -1.692011 -0.190816 -3.17642
H  -3.451743 1.380227 3.223623
H  -1.253216 2.56571 3.552561
H  1.154742 -3.988285 -0.08063
H  0.044415 -2.957087 -0.978609
H  -4.053138 -1.527519 2.392673
H  -3.592429 -1.895311 0.696565
H  -5.330728 -1.698472 1.134502
H  -4.49633 2.635277 0.550763
H  2.162075 -4.676921 -3.840678
H  -6.854694 2.57848 -0.870895
H  -7.230268 2.844383 0.753935
