program: Gaussian 09
title: 000145735
version: EM64L-G09RevD.01
frameworkgroup: C1[X(C8H18O6S2)]
method: RPBEPBE
basis: SDD
operation: Freq
keyword: #p
keyword: freq=noraman
keyword: PBEPBE/SDD
title: #p freq=noraman PBEPBE/SDD
converged: YES YES NO NO
title: Mulliken charges:
elementType: S S O O O O O O C C C C C C C C H H H H H H H H H H H H H H H H H H
charge: 1.054169 1.054169 -0.418359 -0.418359 -0.517611 -0.517916 -0.517611 -0.517916 -0.369452 -0.369452 -0.380255 -0.380254 -0.273021 -0.273022 -0.730321 -0.730321 0.200026 0.199963 0.199963 0.200026 0.218316 0.218447 0.218316 0.218446 0.227915 0.228084 0.227915 0.228085 0.289008 0.281904 0.289102 0.281904 0.289102 0.289008
chargesum: 0.00000
title: Mulliken charges with hydrogens summed into heavy atoms:
elementType: S S O O O O O O C C C C C C C C
charge: 1.054169 1.054169 -0.418359 -0.418359 -0.517611 -0.517916 -0.517611 -0.517916 0.030538 0.030538 0.056507 0.056508 0.182978 0.182978 0.129693 0.129693
polarizability: 2.45000822e+02 -3.45138644e+00 1.39089744e+02 -4.84780342e-04 -6.67463247e-05 1.37615949e+02
1716.lowfreq: -13.1777 -12.6354 -3.7339 -1.2812 0.0015 0.0027 0.0030 5.4527 12.2518
frequency: -12.6338 5.4435 7.2841 25.3939 39.9930 54.4731 64.9619 87.9095 98.3634 114.5817 114.6850 135.6072 149.4929 154.9130 155.0001 178.4778 206.9423 218.0797 218.4131 257.9250 286.2992 296.9662 297.0880 339.3175 345.4772 379.6083 382.7561 442.0619 451.4174 559.5153 575.1599 601.2675 602.2493 742.3433 769.0700 816.9668 836.7690 837.1407 895.1352 909.5464 911.8645 912.1920 921.4814 993.1315 993.1462 996.5306 1013.0091 1022.7871 1038.9449 1039.1668 1069.4772 1071.3986 1095.0451 1143.7752 1157.4806 1216.9754 1233.6403 1262.3280 1276.5017 1287.3370 1292.0982 1298.4371 1315.4574 1315.5198 1333.1613 1358.3732 1362.8666 1365.7925 1416.0636 1416.0660 1418.8205 1418.8302 1467.5161 1469.5463 1472.0254 1480.9384 1488.6504 1493.5513 2965.0269 2972.5728 2978.2087 2978.2329 2998.9915 3000.8324 3006.2531 3028.5413 3038.3038 3041.9052 3041.9086 3041.9098 3069.8906 3075.1017 3190.9824 3190.9852 3199.0110 3199.0120
redmass: 5.5054 9.3255 8.8217 5.2169 5.7921 1.9608 6.2434 1.8494 2.9537 6.5490 4.7974 1.9133 2.2765 1.0319 1.0323 3.9301 4.1304 4.7054 4.6021 5.3337 5.4350 7.7965 7.7273 9.7750 7.7683 5.5296 8.3505 4.9403 3.7070 9.7940 6.4805 9.1775 8.9510 1.0695 1.0929 1.1449 11.4157 11.2135 1.2230 7.5143 2.8298 2.7298 6.4601 1.1628 1.7551 1.4032 2.7844 4.2602 1.9837 1.9842 2.7142 2.9043 3.7727 1.4667 1.2156 1.3874 1.2447 1.2445 1.0755 1.2718 1.0944 1.1102 1.1342 1.1341 1.3012 1.5498 1.3165 1.3790 1.0516 1.0517 1.0506 1.0506 1.0755 1.0652 1.0805 1.0884 1.0890 1.0958 1.0586 1.0589 1.0550 1.0550 1.0586 1.0579 1.0992 1.1027 1.1066 1.1015 1.0270 1.0285 1.1078 1.1066 1.1079 1.1079 1.1077 1.1077
irintensity: 10.1113 1.7114 0.0006 3.4784 3.0978 0.0012 0.0005 2.6181 0.0029 0.0001 22.7232 0.0001 0.3581 0.0928 0.0011 0.0002 6.1393 0.0001 3.8643 1.0488 0.0001 0.0038 20.7279 0.0049 48.3999 0.0051 81.3531 0.0004 10.2759 112.9935 0.0005 0.0046 153.3932 11.5333 0.0004 2.1227 132.8122 0.0174 0.0180 0.0004 65.6413 0.0070 211.5701 0.0099 61.2051 0.0002 23.7549 0.0000 0.0237 142.7803 0.0002 2.3717 0.0000 0.0001 2.5920 0.0012 38.4743 0.2542 0.0005 0.0000 0.6225 0.0000 7.4552 0.0003 0.2908 0.0000 0.0000 24.0263 0.0261 25.9007 24.1848 0.0107 4.8915 0.0000 0.0000 18.2476 0.0004 35.0492 0.0000 21.2969 71.3166 1.0569 0.0008 83.7650 0.0031 18.3738 0.0019 0.0021 0.0925 0.0305 0.0030 134.6928 0.1436 0.0791 0.0005 0.0006
temp: 298.150 k
press: 1.00000 atm
elementType: 16 16 8 8 8 8 8 8 6 6 6 6 6 6 6 6 1 1 1 1 1 1 1 1 1 1 1 1 1 1 1 1 1 1
symmnumber: 1
zpe: 690913.3 jmol-1
zpe.correction: 0.263155 hartree
zpe.thermalcorrener: 0.284518 hartree
zpe.thermalcorrenthalpy: 0.285462 hartree
zpe.thermalcorrgfe: 0.206671 hartree
zpe.sumelectzpe: -1561.432634 hartree
zpe.sumelectthermal: -1561.411271 hartree
zpe.sumelectthermalent: -1561.410327 hartree
zpe.sumelectthermalfe: -1561.489117 hartree
dipole: 0.0000 0.0000 -0.1069
dipole: 0.1069
quadrupole: -116.2262 -112.9884 -124.1309
quadrupole: -52.5215 -0.0026 0.0006
quadrupole: 1.5557 4.7934 -6.3490 -52.5215 -0.0026 0.0006
hfenergy: -1561.6957886 hartree
pointgroup: C01 [X(C8H18O6S2)]
dipole: 0.0000068 -0.0000015 0.0420415 debye
polarizability: 245.0034006|3.411592|139.0871652|0.0004848|-0.0000669|137.6159492 unknown
InChI: InChI=1S/C8H18O6S2/c1-15(9,10)13-7-5-3-4-6-8-14-16(2,11)12/h3-8H2,1-2H3
charge 0 multiplicity 1
34 atoms
S  6.000378 -0.181211 0.006516
S  -6.000396 0.181168 0.006506
O  4.313507 0.624391 0.014104
O  -4.313525 -0.624431 0.013989
O  6.235328 -0.942922 -1.403173
O  6.229366 -0.980792 1.396171
O  -6.235367 0.943029 -1.403099
O  -6.229367 0.9806 1.396249
C  0.652861 -0.41347 0.007751
C  -0.65288 0.413433 0.007775
C  1.914451 0.483953 0.009097
C  -1.914469 -0.48399 0.009048
C  3.198651 -0.356651 0.006904
C  -3.19867 0.356613 0.006886
C  6.921713 1.476461 0.030486
C  -6.921728 -1.476508 0.030311
H  0.667385 -1.075682 -0.88192
H  0.666673 -1.076891 0.896532
H  -0.666698 1.076792 0.896602
H  -0.667396 1.075708 -0.881849
H  1.912056 1.137971 0.90167
H  1.911509 1.141998 -0.880471
H  -1.912087 -1.138063 0.901581
H  -1.911513 -1.141981 -0.880561
H  3.261267 -0.986158 -0.902154
H  3.258344 -0.995693 0.909445
H  -3.261266 0.986185 -0.902127
H  -3.258383 0.995589 0.909472
H  6.604906 1.984207 0.950221
H  7.991526 1.226974 0.028211
H  6.606949 2.009416 -0.875602
H  -7.991541 -1.227023 0.028071
H  -6.606971 -2.009368 -0.875835
H  -6.604912 -1.984349 0.949991
