program: Gaussian 09
title: 000145734
version: EM64L-G09RevD.01
frameworkgroup: C1[X(C6HClF4O)]
method: RPBEPBE
basis: SDD
operation: Freq
keyword: #p
keyword: freq=noraman
keyword: PBEPBE/SDD
title: #p freq=noraman PBEPBE/SDD
converged: NO NO NO NO
title: Mulliken charges:
elementType: Cl F F F F O C C C C C C H
charge: 0.079490 -0.143800 -0.177643 -0.146093 -0.146243 -0.383129 0.048301 0.121138 0.122285 0.388532 0.384681 -0.537553 0.390033
chargesum: 0.00000
title: Mulliken charges with hydrogens summed into heavy atoms:
elementType: Cl F F F F O C C C C C C
charge: 0.079490 -0.143800 -0.177643 -0.146093 -0.146243 0.006904 0.048301 0.121138 0.122285 0.388532 0.384681 -0.537553
polarizability: 1.17387961e+02 6.20887553e-01 8.69382675e+01 -1.76409168e-03 -1.20035067e-04 3.06593572e+01
1716.lowfreq: -9.0827 -0.0026 -0.0022 0.0009 4.8553 8.5939 99.9285 123.0092 159.1935
frequency: 99.9273 123.0087 159.1911 187.1789 195.3592 255.6280 262.4069 284.6569 288.4026 328.2352 360.0992 377.9181 406.3943 424.9538 481.4214 558.4644 608.1251 625.1169 710.0130 745.4233 814.8808 892.7543 1035.3235 1063.6514 1194.4359 1227.2546 1371.2845 1386.7583 1451.1703 1475.4854 1605.2434 1624.2221 3548.9266
redmass: 15.3620 18.4894 15.6950 23.8980 11.8324 13.9774 9.9563 14.3117 14.3323 12.1134 6.9293 16.1695 1.1870 15.3185 17.5702 14.0781 10.1052 12.0489 8.9369 11.4965 13.9009 7.7981 10.8844 10.6666 2.6315 2.8024 10.4961 9.5323 11.9318 7.5524 9.3015 11.0261 1.0661
irintensity: 0.5300 0.0118 0.1364 0.0418 0.4165 2.4591 5.5332 4.2917 0.1268 0.5403 11.6043 0.7754 159.1911 0.4780 1.4724 0.1035 5.2903 1.5886 10.3938 1.2270 119.6909 134.7585 78.0644 3.9401 111.4765 85.9728 15.5938 35.0377 217.8858 158.4846 1.4903 17.0078 111.4698
temp: 298.150 k
press: 1.00000 atm
elementType: 17 9 9 9 9 8 6 6 6 6 6 6 1
symmnumber: 1
zpe: 156551.2 jmol-1
zpe.correction: 0.059627 hartree
zpe.thermalcorrener: 0.070328 hartree
zpe.thermalcorrenthalpy: 0.071272 hartree
zpe.thermalcorrgfe: 0.023040 hartree
zpe.sumelectzpe: -1162.974315 hartree
zpe.sumelectthermal: -1162.963615 hartree
zpe.sumelectthermalent: -1162.962670 hartree
zpe.sumelectthermalfe: -1163.010903 hartree
dipole: -1.4326 -1.5753 0.0000
dipole: 2.1293
quadrupole: -69.3711 -82.3781 -70.7475
quadrupole: 6.2644 0.0002 0.0000
quadrupole: 4.7944 -8.2125 3.4181 6.2644 0.0002 0.0000
hfenergy: -1163.0339422 hartree
pointgroup: C01 [X(C6H1Cl1F4O1)]
dipole: -0.5465822 -0.6348358 -0.0000184 debye
dipolederiv: -0.5638206 -0.0064255 0.0000132 -0.0043118 -0.0110634 0.0000005 0.0000174 0.0000003 0.0387355 -0.3704237 0.3368986 0.0000068 0.3626034 -0.7523101 -0.000009 0.0000064 -0.0000101 -0.0829231 -0.4169689 -0.3463397 0.0000086 -0.3422082 -0.7424356 0.000011 0.0000098 0.0000179 -0.0941265 -0.3160097 0.324859 0.0000006 0.2953993 -0.7556818 0.0000011 -0.0000019 0.0000045 -0.0942471 -0.301364 -0.3224181 0.0000046 -0.2848728 -0.7523765 0.0000069 0.0000018 0.0000005 -0.0954367 -1.4371317 -0.1192645 0.0000197 -0.1404096 -0.0866289 0.0000149 0.0000374 0.0000138 -0.3796531 1.341316 0.1140874 -0.0000298 0.1126619 -0.0703984 -0.0000061 -0.0000345 -0.0000094 0.0916292 0.1862644 -0.4478926 -0.0000038 -0.5692323 0.8020993 0.0000141 -0.0000078 0.0000143 0.0397432 0.1089199 0.3791414 -0.0000054 0.4856232 0.7296838 -0.0000151 -0.0000042 -0.000017 0.0050307 0.2539473 -0.3586317 0.0000072 -0.2614509 0.8717812 -0.0000046 0.0000091 -0.000007 0.1633625 0.249796 0.4037809 0.0000005 0.25437 0.8745445 -0.0000042 0.0000052 -0.0000015 0.1443091 0.7870968 -0.0030015 -0.0000236 0.0220261 -0.251732 -0.0000004 -0.0000338 0.0000019 -0.1479974 0.4783782 0.0452062 0.0000016 0.0698016 0.1445179 -0.000009 -0.0000049 -0.0000083 0.4115738 unknown
polarizability: 117.331817|1.4463454|86.9944114|-0.0017602|-0.0001679|30.6593572 unknown
InChI: InChI=1S/C6HClF4O/c7-1-2(8)4(10)6(12)5(11)3(1)9/h12H
charge 0 multiplicity 1
13 atoms
Cl 3.198813 0.017979 -0.000059
F  -1.424446 2.408301 0.00004
F  -1.424368 -2.41953 0.000053
F  1.37753 -2.429266 0.000007
F  1.340274 2.423491 -0.000018
O  -2.837259 0.015985 0.000074
C  -1.451123 -0.01533 0.000033
C  -0.735094 1.203707 0.00002
C  -0.704741 -1.215074 0.000023
C  0.698979 -1.217154 0.0000
C  0.673702 1.205325 -0.000012
C  1.408484 0.000524 -0.000018
H  -3.21205 -0.903057 0.000056
