program: Gaussian 09
title: 000145730
version: EM64L-G09RevD.01
frameworkgroup: C1[X(C12H8Cl2)]
method: RPBEPBE
basis: SDD
operation: Freq
keyword: #pfreq=noraman
keyword: PBEPBE/SDD
title: #p freq=noraman PBEPBE/SDD
converged: NO YES YES YES
title: Mulliken charges:
elementType: Cl Cl C C C C C C C C C C C C H H H H H H H H
charge: -0.029823 -0.029829 -0.175424 -0.548138 -0.548139 0.318014 0.318019 0.722910 -0.431724 -0.431722 -0.349600 -0.349595 -0.212572 -0.212579 0.239178 0.239164 0.239178 0.239165 0.249537 0.249537 0.252220 0.252221
chargesum: 0.00000
title: Mulliken charges with hydrogens summed into heavy atoms:
elementType: Cl Cl C C C C C C C C C C C C
charge: -0.029823 -0.029829 -0.175424 -0.069795 -0.069797 0.318014 0.318019 0.722910 -0.182186 -0.182185 -0.349600 -0.349595 0.039648 0.039642
polarizability: 2.02017697e+02 -2.00287828e-06 1.78654399e+02 3.86653012e-03 3.81499802e-03 6.21251665e+01
1716.lowfreq: -0.0032 -0.0025 -0.0024 1.1098 12.1513 12.3864 48.3840 84.7684 113.2819
frequency: 48.3804 84.7684 113.2818 185.2515 190.7599 233.7144 296.1531 301.8875 314.4430 370.7109 462.8850 465.0684 472.3260 508.2279 554.9926 570.0255 609.6042 618.5080 689.1582 711.8907 743.8966 808.2261 814.6947 822.8330 848.7827 851.3443 935.6897 946.5056 964.3985 1013.2335 1025.8167 1060.5338 1119.6656 1124.7922 1148.6213 1198.0783 1207.7815 1222.1337 1225.2903 1231.4593 1293.6877 1338.5848 1348.9678 1368.5529 1441.7514 1444.1431 1449.6148 1469.5674 1502.8457 1573.8014 1610.4997 1613.8706 2992.6907 3004.9857 3035.8289 3057.2152 3142.6777 3142.8881 3165.8553 3166.0255
redmass: 7.2891 1.9305 4.6926 4.4243 31.0436 12.2878 4.3763 4.2304 9.4504 11.2821 4.3695 3.3390 4.0658 5.5781 6.5359 6.8145 4.0850 3.5826 6.4739 7.0122 2.4788 6.3457 1.8964 1.2752 5.7324 1.4154 1.3736 1.3621 3.2207 1.9532 3.9983 4.0257 1.9426 2.6119 1.1678 1.4889 1.0997 1.9160 1.7100 1.5551 2.0815 2.5150 2.6203 4.8236 1.7840 4.5769 1.6142 1.1324 4.3504 7.7848 7.4249 8.7710 1.0592 1.0620 1.1027 1.1023 1.0895 1.0898 1.0957 1.0955
irintensity: 0.0000 0.0000 0.1496 8.2994 0.7452 0.4195 1.7675 0.0000 0.2323 7.2444 0.9068 0.1722 0.0000 13.0265 0.0660 1.4413 12.5241 0.0000 9.8503 14.5812 5.8833 11.6915 14.8190 0.0000 20.6741 73.2567 0.0000 0.9700 0.0370 0.0000 43.7511 0.9345 34.9251 4.7860 0.5400 2.7506 0.0001 23.1720 8.2216 8.2124 6.0631 31.0803 56.1314 1.4926 2.1040 31.8721 3.8990 5.8179 0.0853 17.4127 18.0471 1.0884 17.2487 46.4982 0.0001 28.1762 13.6278 6.5882 12.9128 0.0068
temp: 298.150 k
press: 1.00000 atm
elementType: 17 17 6 6 6 6 6 6 6 6 6 6 6 6 1 1 1 1 1 1 1 1
symmnumber: 1
zpe: 420367.0 jmol-1
zpe.correction: 0.160109 hartree
zpe.thermalcorrener: 0.171272 hartree
zpe.thermalcorrenthalpy: 0.172216 hartree
zpe.thermalcorrgfe: 0.122091 hartree
zpe.sumelectzpe: -1381.244195 hartree
zpe.sumelectthermal: -1381.233033 hartree
zpe.sumelectthermalent: -1381.232088 hartree
zpe.sumelectthermalfe: -1381.282213 hartree
dipole: 4.9428 0.0000 0.0001
dipole: 4.9428
quadrupole: -89.1065 -83.9683 -97.5255
quadrupole: -0.0001 0.0002 0.0003
quadrupole: 1.0936 6.2318 -7.3254 -0.0001 0.0002 0.0003
hfenergy: -1381.4043043 hartree
pointgroup: C01 [X(C12H8Cl2)]
dipole: -1.9446335 0.0004877 0.0000229 debye
dipolederiv: -0.7464523 0.2191226 0.0000273 0.1593417 -0.1480689 -0.0000047 0.0000377 -0.0000103 -0.0465669 -0.7466445 -0.2188199 0. -0.1590372 -0.14788 0.0000037 -0.0000078 0.0000031 -0.0465714 -0.1783829 0.0000312 0.000007 0.0000286 -0.0615718 -0.0000105 0.0000013 0.0000116 -0.0292841 -0.1041769 0.0769505 -0.0000402 -0.0639231 0.0456625 -0.0000236 -0.0002367 -0.0000005 0.1529818 -0.1041849 -0.0768739 0.0000579 0.0639977 0.0456696 -0.0000296 0.0002494 0.0000098 0.1529823 0.3292289 -0.000321 0.0000384 -0.0858457 -0.0643041 -0.0000066 0.0001993 -0.0000313 -0.0254934 0.3292757 0.0001203 -0.0000677 0.0856486 -0.0643518 -0.0000155 -0.0002042 -0.0000176 -0.025494 -0.5383484 0.0001952 0.0000116 0.0001994 0.2462301 -0.0000031 0.0000109 -0.0000067 0.1491047 -0.0804147 0.0026817 -0.0000049 0.1912959 0.0753696 0.00001 -0.000032 0.0000095 -0.189416 -0.0805121 -0.0026021 0.0000066 -0.1912176 0.0754706 0.000001 0.0000324 -0.0000128 -0.1894148 1.082693 -0.3940846 -0.0000623 -0.1317475 0.0081429 0.0000094 -0.0000746 0.0000205 -0.1214128 1.08296 0.3935433 0.0000203 0.1312043 0.0078756 -0.0000082 0.0000314 -0.0000012 -0.1214097 -0.1470057 0.1308596 0.0000012 -0.1132655 -0.0071392 -0.0000009 0.0000143 -0.0000149 -0.0854147 -0.147015 -0.130792 -0.0000088 0.1133308 -0.0071335 -0.0000126 -0.0000264 -0.000004 -0.0854159 -0.0214611 -0.0308073 -0.0696473 -0.0105982 0.031358 -0.058119 -0.1289462 -0.0743315 -0.0305459 -0.021528 -0.0308905 0.0696723 -0.0107055 0.0312839 0.0581463 0.1289752 0.0743469 -0.0303908 -0.0214317 0.0308298 0.0696193 0.0106159 0.031342 -0.0581513 0.1289065 -0.0743993 -0.0305622 -0.0215155 0.0309212 -0.0696409 0.0107427 0.0312578 0.0581855 -0.1289404 0.0744104 -0.030375 0.0149356 -0.0913119 0.0000042 -0.0835353 -0.046697 0.0000031 -0.0000038 -0.0000001 0.159462 0.0150219 0.0912826 -0.0000022 0.0835042 -0.0467849 0.0000093 0.0000072 0.0000092 0.1594615 0.0525138 0.075654 0.0000005 0.0632436 -0.0179029 0.0000031 0.0000092 0.0000025 0.1568873 0.0524449 -0.0756889 0.0000077 -0.0632778 -0.0178285 0.0000144 -0.0000026 0.000007 0.156888 unknown
polarizability: 202.0176954|-0.0059266|178.6544009|-0.0038675|-0.003814|62.1251665 unknown
InChI: InChI=1S/C12H8Cl2/c13-9-5-3-7-1-2-8-4-6-10(14)12(9)11(7)8/h3-6H,1-2H2
charge 0 multiplicity 1
22 atoms
Cl 3.192299 -1.60961 -0.000119
Cl 3.193114 1.607967 -0.000075
C  -0.637858 0.000147 0.000031
C  -2.919808 -0.785923 -0.000114
C  -2.919405 0.787377 0.000255
C  -1.445681 -1.178267 0.000053
C  -1.445083 1.178967 0.000018
C  0.807787 -0.000217 -0.000024
C  -0.827335 -2.425984 0.000076
C  -0.826109 2.426372 -0.000122
C  1.389986 -1.319181 -0.000015
C  1.390646 1.31845 -0.000104
C  0.601874 -2.477441 0.000051
C  0.603124 2.477113 -0.000183
H  -3.442124 -1.189562 -0.887275
H  -3.442569 -1.190032 0.886563
H  -3.441464 1.191265 0.887455
H  -3.442013 1.191769 -0.886384
H  -1.399244 -3.359509 0.000093
H  -1.397551 3.360183 -0.000171
H  1.106086 -3.448708 0.000057
H  1.107831 3.448123 -0.000264
