program: Gaussian 09
title: 000145728
version: EM64L-G09RevD.01
frameworkgroup: C1[X(C9H6N4O4)]
method: RPBEPBE
basis: SDD
operation: Freq
keyword: #pfreq=noraman
keyword: PBEPBE/SDD
title: #p freq=noraman PBEPBE/SDD
converged: YES YES NO NO
title: Mulliken charges:
elementType: O O O O N N N N C C C C C C C C C H H H H H H
charge: -0.190898 -0.239563 -0.198426 -0.201690 -0.427258 -0.074997 0.051966 0.028447 0.417652 0.110897 -0.340257 -0.339795 0.320285 0.386495 -0.355688 -0.363300 -0.335442 0.360303 0.292978 0.219909 0.293635 0.293024 0.291723
chargesum: 0.00000
title: Mulliken charges with hydrogens summed into heavy atoms:
elementType: O O O O N N N N C C C C C C C C C
charge: -0.190898 -0.239563 -0.198426 -0.201690 -0.066954 -0.074997 0.051966 0.028447 0.417652 0.110897 -0.047280 -0.119886 0.320285 0.386495 -0.062053 -0.070276 -0.043719
polarizability: 3.30419020e+02 -1.79678251e+00 1.50009905e+02 -9.27281499e-02 4.56586762e-02 5.20029503e+01
1716.lowfreq: -8.0353 -5.7843 -3.0406 -0.0009 -0.0006 0.0000 29.7192 47.7069 65.7886
frequency: 29.4783 47.6650 65.7843 70.8237 97.0077 143.0258 172.3801 221.2320 231.5018 250.9388 332.6354 391.9902 407.4129 443.0242 491.9279 497.6718 511.4567 554.6285 582.9821 624.5733 662.3237 688.2053 693.5544 707.7192 737.8876 737.9920 760.1900 790.1724 839.3112 877.7789 882.2916 916.5867 985.5085 987.9666 1001.3566 1012.6749 1049.2687 1092.6344 1110.4243 1141.5138 1172.8289 1183.2162 1216.7056 1243.1088 1289.3882 1298.7329 1317.3145 1349.6336 1367.7009 1392.2333 1412.0322 1427.4704 1441.5066 1487.3683 1534.1925 1591.4542 1613.4718 3138.7706 3169.7526 3185.8359 3189.8236 3255.0225 3559.7221
redmass: 7.4870 9.4699 6.5048 10.7109 9.8546 6.5617 9.8170 8.5042 12.0375 6.8258 6.5919 9.1472 2.8510 8.7055 3.7395 8.1634 6.8605 5.7606 3.9908 7.1264 4.5974 7.1699 8.7004 4.9325 2.3807 2.3678 4.1889 9.3558 1.3724 1.4076 1.5367 6.7286 1.3669 7.3192 3.2451 1.3568 2.1872 3.1187 1.3595 4.1709 1.8453 1.4603 4.8299 2.6504 1.9287 3.6502 2.1206 11.8829 8.1487 8.6979 7.7381 4.1006 3.0337 4.4892 4.8602 7.7563 6.1527 1.0904 1.0899 1.0947 1.0968 1.1001 1.0815
irintensity: 0.4163 3.4954 0.0330 3.4921 1.0706 1.7928 2.4604 9.6394 0.7262 5.6050 1.3987 1.4953 0.1039 4.5185 4.6072 3.7497 0.1373 6.5946 4.8142 0.0426 9.9154 30.2981 8.7612 6.0664 42.5410 42.6421 12.3893 44.2298 24.4671 61.1268 26.3782 2.9697 1.5264 13.5366 2.2746 0.0360 15.8157 27.9026 26.1073 62.1229 27.5691 74.7110 632.6626 325.6071 9.8040 43.0448 3.4915 112.4602 92.0079 107.0907 27.7411 72.7524 39.1646 69.9781 6.4245 1.0157 44.9058 9.6318 0.7576 1.5968 1.6134 2.7983 75.1924
temp: 298.150 k
press: 1.00000 atm
elementType: 8 8 8 8 7 7 7 7 6 6 6 6 6 6 6 6 6 1 1 1 1 1 1
symmnumber: 1
zpe: 398839.7 jmol-1
zpe.correction: 0.151910 hartree
zpe.thermalcorrener: 0.165514 hartree
zpe.thermalcorrenthalpy: 0.166458 hartree
zpe.thermalcorrgfe: 0.109372 hartree
zpe.sumelectzpe: -865.098912 hartree
zpe.sumelectthermal: -865.085309 hartree
zpe.sumelectthermalent: -865.084364 hartree
zpe.sumelectthermalfe: -865.141451 hartree
dipole: 0.7303 0.1766 0.0084
dipole: 0.7514
quadrupole: -152.1531 -94.9845 -96.3372
quadrupole: 3.6939 -0.0382 0.0862
quadrupole: -37.6615 19.5071 18.1544 3.6939 -0.0382 0.0862
hfenergy: -865.2508225 hartree
pointgroup: C01 [X(C9H6N4O4)]
dipole: -0.2876996 0.0675372 -0.0072495 debye
dipolederiv: -1.2263827 0.0562323 0.0050507 0.2227322 -0.4310733 0.0149387 -0.01 0.0166533 -0.2219593 -0.5134922 0.026412 0.0004242 -0.4585537 -0.8703195 0.0547282 0.0409813 0.0505572 -0.2604013 -0.9287184 -0.1842552 0.0236515 -0.2840993 -0.6013449 0.0388435 0.0335995 0.038183 -0.2267839 -0.8140749 0.1881546 -0.0133123 0.3421561 -0.701168 0.043024 -0.0285492 0.044441 -0.2294157 0.2531992 0.131443 -0.0159745 -0.0520383 -0.5527829 0.0340511 -0.0039257 0.0329508 -0.1782714 -0.6831236 -0.114955 0.0133353 0.3427405 -0.2296777 -0.0051092 -0.0253119 -0.0016598 -0.2540654 2.329781 0.2665871 -0.0422981 0.7966278 1.2854699 -0.0937874 -0.0858747 -0.0899063 0.2362069 2.2962756 -0.0731042 -0.0103386 -0.1414998 1.0836673 -0.0843045 -0.0034653 -0.0854311 0.2012329 0.4631764 -0.0745064 0.0031954 -0.0320241 0.0952659 -0.0044189 -0.0015085 -0.0036004 0.0519143 0.3615362 0.0347033 -0.0047641 -0.426394 0.2282717 -0.0082084 0.037547 -0.0136691 0.0874277 -0.4445815 -0.1460642 0.0175195 -0.115437 0.0515366 -0.0152657 0.01482 -0.0141454 -0.1102923 -0.2484598 0.1794367 -0.017471 0.1964315 -0.0435684 -0.01335 -0.0189835 -0.0127667 -0.1508753 -1.2904949 -0.4184875 0.0477694 -0.5788888 -0.2186278 0.0286734 0.0638849 0.0285929 0.0680485 -1.0110595 0.0756656 0.0016083 0.2241252 0.0644365 -0.0032121 -0.0130999 -0.0020091 0.054977 0.323911 0.1457604 -0.0179959 -0.1983031 -0.0222428 -0.0052499 0.0144621 -0.0080899 -0.0909102 0.1652824 -0.1589428 0.0134278 0.0568311 -0.0374799 -0.0052346 -0.006824 -0.0033541 -0.0844034 0.320348 0.1366906 -0.0152522 0.0328489 0.3615076 -0.0363275 -0.0069608 -0.0367982 -0.0525712 0.2697708 -0.0212695 0.0022936 0.1011018 0.2338916 0.0082416 -0.0077578 0.0089624 0.3375606 0.1197494 0.0469109 -0.0045786 0.0434017 0.0455259 0.0106206 -0.0043726 0.0102347 0.1525162 -0.0038609 -0.1041526 0.0117818 -0.0910162 -0.0010177 0.0157986 0.0107664 0.0156468 0.1466992 0.0878994 -0.0561241 0.0063254 -0.0194405 0.0837412 0.0088956 0.0029776 0.0091024 0.1698436 0.1057555 0.0444094 -0.0038071 0.0123941 0.0610644 0.011056 -0.0008799 0.0107146 0.1718732 0.0675635 0.0194556 -0.0005904 0.026304 0.1149243 0.0055969 -0.0015249 0.0053911 0.1816492 unknown
polarizability: 330.3751737|2.5560813|149.1977652|-2.5426567|-9.0192107|52.8589359 unknown
InChI: InChI=1S/C9H6N4O4/c14-12(15)7-3-1-6(2-4-7)9-10-5-8(11-9)13(16)17/h1-5,11H
charge 0 multiplicity 1
23 atoms
O  -5.625543 -0.008494 0.067476
O  -4.365118 -1.93303 0.214757
O  5.359287 0.764784 -0.101199
O  5.074873 -1.489219 0.118867
N  -2.055058 -0.510685 0.07746
N  -1.673023 1.712474 -0.119604
N  -4.500265 -0.63862 0.109107
N  4.619134 -0.286521 0.006553
C  0.360948 0.244174 -0.008766
C  -1.083315 0.474811 -0.017343
C  1.223728 1.370653 -0.12817
C  0.921954 -1.058414 0.115293
C  -3.293461 0.123719 0.034002
C  3.145982 -0.101027 0.000848
C  2.617843 1.203575 -0.123909
C  2.315715 -1.237038 0.120496
C  -3.037837 1.501145 -0.08866
H  -1.958939 -1.524769 0.159731
H  0.773691 2.362882 -0.22264
H  0.282614 -1.943268 0.210247
H  3.298876 2.053521 -0.214219
H  2.769385 -2.226805 0.214688
H  -3.759173 2.311153 -0.151913
