program: Gaussian 09
title: 000145726
version: EM64L-G09RevD.01
frameworkgroup: C1[X(C15H10O4)]
method: RPBEPBE
basis: SDD
operation: Freq
keyword: #pfreq=noraman
keyword: PBEPBE/SDD
title: #p freq=noraman PBEPBE/SDD
converged: YES YES NO NO
title: Mulliken charges:
elementType: O O O O C C C C C C C C C C C C C C C H H H H H H H H H H
charge: -0.307774 -0.251658 -0.489194 -0.414595 0.235330 0.190180 0.406614 0.189264 -0.420502 0.136690 -0.491352 -0.356301 -0.389559 -0.357730 0.187834 -0.329993 -0.248592 -0.209079 0.138139 0.246527 0.265425 0.234379 0.282094 0.254657 0.258938 0.236928 0.235375 0.378238 0.389716
chargesum: 0.00000
title: Mulliken charges with hydrogens summed into heavy atoms:
elementType: O O O O C C C C C C C C C C C C C C C
charge: -0.307774 -0.251658 -0.110956 -0.024879 0.235330 0.190180 0.406614 0.189264 -0.173975 0.136690 -0.225927 -0.074207 -0.155180 -0.103073 0.187834 -0.071055 -0.011664 0.026296 0.138139
polarizability: 3.31182600e+02 5.27238133e+00 2.00462954e+02 2.54244995e-01 -9.05309551e-02 6.69691110e+01
1716.lowfreq: -5.7036 -1.1041 -0.0004 0.0003 0.0006 8.9658 16.1847 48.3150 89.2983
frequency: 15.8868 48.3058 89.2981 107.6860 149.1044 156.1645 215.5083 237.2886 256.1648 263.7457 277.8770 284.3152 304.5283 339.0452 427.9279 437.9959 442.2939 490.3826 495.4024 518.0561 519.3455 558.2415 562.7596 571.1778 588.0948 637.5645 662.2380 665.0158 724.0973 729.7664 758.1836 768.0396 780.2732 815.5687 819.7928 841.9496 861.0814 877.6903 882.8790 921.1929 948.3611 970.1617 1001.7746 1009.7269 1028.8474 1076.6497 1077.0416 1128.2799 1136.1302 1163.0471 1174.5940 1194.0230 1202.2132 1243.0654 1258.7954 1270.6812 1303.0839 1326.4397 1344.1261 1399.3372 1409.6811 1443.5416 1448.3052 1461.4033 1517.3984 1553.7687 1574.1629 1602.6032 1615.4264 1622.2794 1626.1013 3138.7604 3151.5112 3155.2564 3158.8984 3164.1951 3174.7803 3181.1538 3189.9637 3517.2908 3624.8561
redmass: 5.1917 6.6951 6.3004 6.2407 6.0091 4.7560 5.2868 8.6763 5.6525 2.2750 1.6466 5.1407 8.4809 5.7278 3.3867 3.1582 5.8768 7.2543 8.3479 1.9071 1.5203 5.0507 6.8890 7.7532 5.9269 6.8565 3.5057 4.0635 5.9405 3.3925 2.6452 5.8416 1.4139 6.4236 1.4946 7.1349 1.5396 1.5811 1.5247 5.1312 1.3709 1.3672 1.3308 3.0240 2.0927 2.3437 3.5148 1.5800 1.3872 1.1998 1.2863 1.7937 2.5279 2.1453 1.8843 1.5347 1.9643 4.8852 2.1588 10.3959 3.5035 4.1835 3.1537 2.6953 3.6183 8.9525 6.9469 6.1461 7.1162 7.3937 7.5351 1.0860 1.0899 1.0912 1.0887 1.0952 1.1004 1.0967 1.0908 1.0648 1.0667
irintensity: 0.0811 0.0111 0.1977 3.5465 0.0076 2.0678 2.3594 0.6132 6.6797 58.0880 117.7507 3.5710 16.7385 2.4944 0.9676 8.6041 5.1921 0.3812 2.7928 82.0578 64.8606 8.5546 9.5231 11.8276 27.2465 0.4582 1.5429 6.8966 0.5644 2.3100 18.8338 27.0316 82.6980 13.5665 18.8776 32.8658 58.6664 16.5044 2.0800 14.8449 0.0074 3.0487 0.2900 5.7696 16.3928 215.6327 4.7778 15.0856 37.4440 0.1697 111.6610 398.7237 10.9240 68.1709 43.2942 12.1565 66.6321 439.1738 48.8778 12.4193 11.3104 12.2970 72.0634 8.1897 164.7527 194.7412 40.7894 248.7382 190.2149 70.7870 44.3652 3.3121 4.9679 6.7778 2.4986 10.4944 22.2991 3.4420 5.0770 156.4570 55.7830
temp: 298.150 k
press: 1.00000 atm
elementType: 8 8 8 8 6 6 6 6 6 6 6 6 6 6 6 6 6 6 6 1 1 1 1 1 1 1 1 1 1
symmnumber: 1
zpe: 554407.2 jmol-1
zpe.correction: 0.211163 hartree
zpe.thermalcorrener: 0.226372 hartree
zpe.thermalcorrenthalpy: 0.227316 hartree
zpe.thermalcorrgfe: 0.167844 hartree
zpe.sumelectzpe: -877.181716 hartree
zpe.sumelectthermal: -877.166506 hartree
zpe.sumelectthermalent: -877.165562 hartree
zpe.sumelectthermalfe: -877.225035 hartree
dipole: -1.4844 -5.9963 0.0098
dipole: 6.1773
quadrupole: -107.8270 -101.2304 -114.2840
quadrupole: -8.4192 -0.2308 -0.2502
quadrupole: -0.0466 6.5501 -6.5035 -8.4192 -0.2308 -0.2502
hfenergy: -877.3928784 hartree
pointgroup: C01 [X(C15H10O4)]
dipole: 0.5660077 2.3599918 -0.1286515 debye
polarizability: 331.094491|6.2388506|200.1417497|-0.6892692|-7.3818398|67.3784238 unknown
InChI: InChI=1S/C15H10O4/c16-11-6-5-9(7-13(11)18)15-8-12(17)10-3-1-2-4-14(10)19-15/h1-8,16,18H
charge 0 multiplicity 1
29 atoms
O  -0.606562 0.679078 -0.012985
O  -2.83503 -2.853624 0.212195
O  4.214923 2.185242 -0.065624
O  5.719544 -0.045887 0.021656
C  0.034439 -0.572006 0.06563
C  -2.810635 -0.430922 0.05907
C  1.502294 -0.44196 0.05424
C  -2.015068 0.740286 -0.014877
C  -0.700348 -1.739437 0.142056
C  -2.161968 -1.770223 0.143651
C  2.103598 0.849379 -0.002121
C  -4.222037 -0.287905 0.050767
C  2.344999 -1.587749 0.0983
C  -2.586045 2.0283 -0.095594
C  3.498227 0.96876 -0.01241
C  3.745889 -1.459236 0.087795
C  -4.810512 0.985958 -0.029034
C  -3.989089 2.144302 -0.102245
C  4.335259 -0.180493 0.032592
H  -0.189753 -2.70229 0.20658
H  1.46208 1.735817 -0.03651
H  1.912186 -2.59094 0.139124
H  -4.820164 -1.203363 0.108609
H  -1.935399 2.905924 -0.151596
H  4.398009 -2.336203 0.121051
H  -5.900267 1.090154 -0.035118
H  -4.447612 3.137005 -0.164715
H  3.618555 2.970636 -0.097195
H  5.951587 0.920201 -0.018593
