program: Gaussian 09
title: 000145725
version: EM64L-G09RevD.01
frameworkgroup: C1[X(C8H4Cl2O4)]
method: RPBEPBE
basis: SDD
operation: Freq
keyword: #p
keyword: freq=noraman
keyword: PBEPBE/SDD
title: #p freq=noraman PBEPBE/SDD
converged: YES YES NO NO
title: Mulliken charges:
elementType: Cl Cl O O O O C C C C C C C C H H H H
charge: -0.001513 -0.001508 -0.213888 -0.213869 -0.136813 -0.136831 0.401295 0.401278 -0.521653 -0.327663 -0.327648 -0.178505 0.054323 0.054333 0.301585 0.301206 0.301222 0.244651
chargesum: 0.00000
title: Mulliken charges with hydrogens summed into heavy atoms:
elementType: Cl Cl O O O O C C C C C C C C
charge: -0.001513 -0.001508 -0.213888 -0.213869 -0.136813 -0.136831 0.401295 0.401278 -0.220068 -0.026457 -0.026426 0.066146 0.054323 0.054333
polarizability: 1.94396474e+02 -9.41589181e-04 1.33867949e+02 3.92855953e-03 1.01846833e-01 4.39044987e+01
1716.lowfreq: -5.8002 -0.0024 -0.0022 0.0008 2.6454 2.9027 23.1121 24.8025 57.1046
frequency: 23.1114 24.7605 57.0961 77.0413 80.8356 156.0721 211.1722 244.4640 245.8711 271.1022 287.0396 385.9547 433.4858 451.5904 455.2815 545.0323 568.9146 583.3846 594.4072 595.2656 678.8898 701.3867 761.5437 765.1289 798.9969 880.8043 901.2960 922.8671 983.6769 990.9403 1041.2211 1048.8028 1097.7788 1101.0729 1187.7653 1194.1584 1285.8401 1387.9799 1446.7702 1463.4121 1586.0417 1616.4979 1691.7685 1693.5292 3160.5988 3192.9530 3206.1297 3210.6326
redmass: 18.1040 12.0574 7.4298 9.9433 17.7123 11.7218 18.1750 7.6159 4.8446 12.0548 9.1903 7.9430 19.3519 9.4093 3.0982 10.0534 9.1010 6.4424 12.3853 11.3269 2.4504 8.6772 10.6718 14.4664 1.2860 7.0151 1.5350 1.3493 6.3145 1.3137 3.9354 12.3167 2.1294 1.6925 5.5945 1.1069 1.3418 8.7351 2.7470 2.3645 7.6342 6.9830 12.8008 12.7472 1.0904 1.0937 1.0930 1.0969
irintensity: 0.0013 2.4699 0.2468 0.0001 1.0290 2.7978 2.6539 0.0008 0.0000 0.4937 19.2612 2.5700 10.6612 4.3458 4.8275 88.9791 6.4434 0.0029 14.5946 0.0026 22.0262 4.3056 59.3770 108.8262 67.0244 114.3120 47.7759 0.0030 5.9958 3.1006 1162.7118 160.2799 528.3301 52.5617 47.9613 21.1864 12.6281 18.9315 33.3155 128.6084 44.8886 108.5507 290.1386 357.6289 7.6910 3.5601 7.2753 0.3155
temp: 298.150 k
press: 1.00000 atm
elementType: 17 17 8 8 8 8 6 6 6 6 6 6 6 6 1 1 1 1
symmnumber: 1
zpe: 276877.9 jmol-1
zpe.correction: 0.105457 hartree
zpe.thermalcorrener: 0.118408 hartree
zpe.thermalcorrenthalpy: 0.119352 hartree
zpe.thermalcorrgfe: 0.062296 hartree
zpe.sumelectzpe: -1527.248922 hartree
zpe.sumelectthermal: -1527.235971 hartree
zpe.sumelectthermalent: -1527.235027 hartree
zpe.sumelectthermalfe: -1527.292083 hartree
dipole: 0.0004 1.2291 -0.0129
dipole: 1.2292
quadrupole: -115.9997 -88.6615 -93.0269
quadrupole: 0.0002 -0.0072 -0.0393
quadrupole: -16.7704 10.5679 6.2024 0.0002 -0.0072 -0.0393
hfenergy: -1527.354379 hartree
pointgroup: C01 [X(C8H4Cl2O4)]
dipole: -0.0001308 -0.4235041 0.233465 debye
dipolederiv: -0.604921 -0.3288841 0.1855574 -0.5126381 -0.4997173 0.246054 0.2900197 0.2464474 -0.2041454 -0.6050089 0.3290033 -0.1853989 0.5131421 -0.50008 0.2460154 -0.2891985 0.2459227 -0.2037056 -2.3944106 -0.431552 0.2390283 -0.0854329 -0.3924405 0.1445079 0.0388355 0.1434027 -0.2200829 -2.3943155 0.4317657 -0.2384739 0.0854769 -0.3923353 0.1446291 -0.0385409 0.143397 -0.2201681 -0.8075973 0.0288023 -0.0185284 0.2602719 -0.7932419 0.317219 -0.1508755 0.3157589 -0.4196972 -0.8075339 -0.0287345 0.0185384 -0.2597034 -0.7930416 0.3168828 0.1516803 0.3163691 -0.4199277 1.2699292 0.2798856 -0.1579847 0.5410967 0.3655781 -0.1488119 -0.306339 -0.1500739 0.1850343 1.269875 -0.2797497 0.1581452 -0.5407739 0.3655232 -0.1487599 0.3069033 -0.150192 0.1850685 -0.5519627 -0.0000008 0.0000155 -0.0001267 -0.1220181 -0.0188051 -0.000237 -0.0183699 -0.1427916 -0.2709385 -0.0665389 0.0375879 -0.1224941 -0.2227717 0.0435326 0.0697687 0.0437637 -0.1699712 -0.2709495 0.0665503 -0.0375371 0.1224132 -0.2228014 0.0435824 -0.0699152 0.0437691 -0.1699866 0.059553 0.0000297 0.000038 0.0000364 0.1241148 -0.1411871 0.0000796 -0.1416231 -0.0447206 2.8549047 0.5194089 -0.2855639 -0.0609189 1.3533595 -0.6259054 0.0478058 -0.6230387 0.6109939 2.8548165 -0.5199262 0.2846496 0.0597606 1.3534647 -0.6256308 -0.0498199 -0.6230709 0.610832 0.1504295 -0.0000087 -0.000019 -0.0000283 0.0874125 0.0628072 -0.000044 0.062929 0.1624712 0.0954253 0.0458645 -0.0259509 0.0518811 0.150773 0.023929 -0.0295028 0.0241665 0.1791999 0.0955194 -0.0459037 0.0259023 -0.0519625 0.1508117 0.023899 0.0293774 0.0241916 0.1791934 0.0571854 -0.0000117 -0.0000058 0. -0.0125895 0.0960419 0.0000026 0.0962508 0.1024038 unknown
polarizability: 194.396474|-0.0040753|112.0103228|-0.0073074|-38.5829235|65.7621249 unknown
InChI: InChI=1S/C8H4Cl2O4/c9-7(11)13-5-2-1-3-6(4-5)14-8(10)12/h1-4H
charge 0 multiplicity 1
18 atoms
Cl 4.742882 1.484542 -1.001232
Cl -4.742963 1.484793 -1.000396
O  2.35774 0.592759 -0.506004
O  -2.357734 0.592228 -0.507017
O  4.080013 -0.810346 0.302776
O  -4.079785 -0.810169 0.30336
C  1.205796 -0.162833 -0.07734
C  -1.205795 -0.16303 -0.077789
C  0.000017 0.466457 -0.434471
C  1.237395 -1.391069 0.618629
C  -1.237484 -1.391273 0.618146
C  -0.000061 -1.983636 0.954306
C  3.652319 0.190941 -0.269413
C  -3.652255 0.190466 -0.270092
H  0.000036 1.416234 -0.973861
H  2.179317 -1.868741 0.890012
H  -2.179448 -1.869069 0.889183
H  -0.000092 -2.935454 1.4944
