program: Gaussian 09
title: 000145738
version: EM64L-G09RevD.01
frameworkgroup: C1[X(C16H21Cl2N3)]
method: RPBEPBE
basis: SDD
operation: Freq
keyword: #p
keyword: freq=noraman
keyword: PBEPBE/SDD
title: #p freq=noraman PBEPBE/SDD
converged: YES YES NO NO
title: Mulliken charges:
elementType: Cl Cl N N N C C C C C C C C C C C C C C C C H H H H H H H H H H H H H H H H H H H H H
charge: -0.079415 -0.059102 -0.114045 -0.422560 -0.046848 -0.378678 -0.448242 -0.342056 -0.319347 -0.338379 0.386598 -0.578003 -0.657835 0.270423 -0.027128 -0.323571 -0.342854 -0.386422 -0.293528 -0.271788 -0.091254 0.216336 0.213531 0.199053 0.218952 0.233372 0.228549 0.231801 0.227542 0.210947 0.201653 0.294560 0.264043 0.264467 0.219529 0.220170 0.213884 0.233274 0.196166 0.234354 0.286979 0.254871
chargesum: 0.00000
title: Mulliken charges with hydrogens summed into heavy atoms:
elementType: Cl Cl N N N C C C C C C C C C C C C C C C C
charge: -0.079415 -0.059102 -0.114045 -0.128000 -0.046848 0.051189 -0.030237 0.119865 0.139995 0.074221 0.386598 -0.049493 -0.004252 0.270423 -0.027128 -0.090297 -0.146688 -0.152068 -0.006549 -0.016918 -0.091254
polarizability: 3.24043952e+02 2.87450733e+01 2.05881426e+02 -3.11969720e+01 1.78228204e+01 1.43704621e+02
1716.lowfreq: -10.4293 -2.3167 0.0009 0.0018 0.0020 2.6405 13.1559 17.0036 22.2755
frequency: 13.0502 16.8261 21.8492 36.2645 48.1215 64.1551 74.6442 87.9188 110.1054 124.9854 143.9010 173.4500 189.1094 215.9380 234.4912 244.1878 258.9167 281.2354 281.4582 285.8368 337.0544 369.0551 381.1590 397.3206 417.6769 434.5743 464.0661 480.6569 502.0930 503.2354 526.2144 577.0174 615.9491 640.6969 642.1656 651.8296 731.7469 747.4918 759.6791 772.4313 794.8166 806.8802 816.0794 827.5530 836.8916 866.3830 876.2058 897.4804 932.2170 946.4023 949.4396 952.1079 1004.5080 1017.7696 1045.0315 1059.1118 1062.5829 1078.6288 1085.9074 1089.6522 1099.1741 1108.7278 1126.6409 1163.9089 1182.8094 1203.6183 1209.9119 1227.5397 1240.1353 1245.2998 1259.7582 1283.3194 1291.9946 1301.2450 1310.7462 1329.9176 1340.4482 1349.9801 1362.1889 1365.5687 1371.3522 1377.2195 1390.6663 1393.0097 1413.5655 1440.0907 1450.7384 1457.1672 1460.0285 1469.7657 1473.0522 1479.2045 1479.6893 1486.0858 1488.4127 1530.9980 1558.5782 1583.9763 1609.9143 2879.9826 2892.7778 2936.1339 2944.3541 2972.6540 2985.3961 3020.5545 3023.6592 3032.9587 3046.5625 3051.6721 3061.3063 3080.3090 3089.6150 3117.0674 3118.9678 3148.1585 3173.7911 3176.4650 3183.6245 3560.0443
redmass: 7.4793 8.3649 4.4801 6.6856 3.8557 3.1103 3.4467 2.6405 4.1756 3.7804 3.2660 2.3655 2.7312 4.0453 2.1639 4.6142 2.3633 5.2528 5.0041 2.5464 2.5468 2.4683 4.3939 2.1802 2.1883 1.9771 2.9388 3.2176 3.4789 3.2653 4.3871 7.6902 5.9687 3.9309 5.1059 6.0795 2.8052 3.9532 1.8535 1.1502 1.1876 2.3292 1.8163 1.9161 2.8474 4.7131 2.6863 1.4971 1.3472 1.7952 2.1938 1.4544 1.5840 2.1765 2.2940 2.8337 1.9356 2.2277 2.4941 1.8337 2.6345 1.8606 1.8419 1.3980 2.2266 1.4450 1.9025 1.6420 1.2088 1.4419 1.3920 1.1523 1.2533 1.3351 1.9658 1.8524 1.6705 1.5273 1.3441 1.3733 1.8395 1.5158 3.2026 1.3448 2.6545 2.4816 1.1070 1.2783 1.0788 1.4014 1.2406 1.0771 1.0942 1.0867 1.0774 4.9362 3.9112 6.4403 6.6873 1.0709 1.0709 1.0683 1.0648 1.0661 1.0359 1.0954 1.0891 1.0927 1.0934 1.0930 1.0571 1.0989 1.1005 1.0884 1.0900 1.1122 1.0950 1.0932 1.0932 1.0759
irintensity: 0.7863 0.9785 0.7998 0.7457 0.2406 0.4860 0.0945 1.3988 0.8929 0.3248 0.7303 0.6384 9.2286 0.5877 2.8348 0.4936 2.3873 3.4965 7.4698 3.7291 3.2343 7.2637 15.4078 54.5823 5.6549 74.1577 0.8963 5.6837 8.2543 6.8333 1.6393 12.2042 1.1938 12.7399 15.6411 103.1187 11.1071 4.3453 18.5604 4.9895 3.1840 37.9561 21.1961 33.2347 25.5633 53.6660 2.4961 25.2069 0.1527 5.0763 7.1340 2.6809 6.5410 2.2673 9.6230 6.2166 13.9838 25.0407 18.6271 5.7065 3.4695 37.3059 13.5351 12.6621 26.6826 23.6709 46.1901 10.3043 34.8548 0.3526 2.7157 1.8097 7.1569 16.0549 17.2093 27.9678 43.9451 2.0419 2.7631 8.8788 2.6863 5.3796 53.9631 39.2699 7.7081 45.3103 6.6220 41.7987 3.2401 17.4384 14.6080 6.7442 25.7971 64.6577 25.4293 60.0316 132.0868 342.7645 78.7986 62.0349 106.0230 66.0295 46.2492 51.9923 21.4265 18.4427 16.9053 6.3896 35.1602 52.2658 21.8624 51.6481 34.0441 17.8270 27.8821 18.6117 4.5948 20.1477 0.8163 21.1084
temp: 298.150 k
press: 1.00000 atm
elementType: 17 17 7 7 7 6 6 6 6 6 6 6 6 6 6 6 6 6 6 6 6 1 1 1 1 1 1 1 1 1 1 1 1 1 1 1 1 1 1 1 1 1
symmnumber: 1
zpe: 898495.4 jmol-1
zpe.correction: 0.342219 hartree
zpe.thermalcorrener: 0.363937 hartree
zpe.thermalcorrenthalpy: 0.364881 hartree
zpe.thermalcorrgfe: 0.287118 hartree
zpe.sumelectzpe: -1705.094400 hartree
zpe.sumelectthermal: -1705.072682 hartree
zpe.sumelectthermalent: -1705.071737 hartree
zpe.sumelectthermalfe: -1705.149500 hartree
dipole: 3.5350 -3.4180 -1.7994
dipole: 5.2362
quadrupole: -190.7726 -137.5857 -136.7806
quadrupole: 2.0211 4.2601 1.9054
quadrupole: -35.7263 17.4606 18.2657 2.0211 4.2601 1.9054
hfenergy: -1705.4366184 hartree
pointgroup: C01 [X(C16H21Cl2N3)]
dipole: 1.4958072 0.7447266 1.2049051 debye
polarizability: 315.1097335|-52.8511127|189.0313195|16.2225899|34.7182744|169.4889457 unknown
InChI: InChI=1S/C16H21Cl2N3/c1-2-21(11-7-17)10-3-8-19-15-6-9-20-16-12-13(18)4-5-14(15)16/h4-6,9,12,19H,2-3,7-8,10-11H2,1H3
charge 0 multiplicity 1
42 atoms
Cl 7.313164 -1.041413 -0.284853
Cl -6.341696 2.074147 0.327986
N  3.646986 0.873884 0.066408
N  0.125468 -0.322752 1.175068
N  -3.036169 -1.49814 -1.475117
C  2.862831 1.163465 1.290175
C  2.439554 -0.125438 2.037764
C  1.441491 -0.97821 1.232303
C  5.073007 0.559571 0.311881
C  3.415762 1.814526 -1.064124
C  -0.89645 -0.701886 0.322201
C  5.469075 -0.661729 -0.529557
C  2.068687 1.584091 -1.774346
C  -2.178992 -0.010062 0.349482
C  -3.208429 -0.458906 -0.566524
C  -0.746061 -1.754529 -0.609924
C  -2.469666 1.084564 1.223258
C  -1.826309 -2.097679 -1.467528
C  -4.485727 0.191659 -0.559098
C  -3.719469 1.71294 1.219674
C  -4.715803 1.244656 0.318482
H  1.953935 1.716393 0.990559
H  3.425374 1.825729 1.990911
H  2.006508 0.14464 3.024423
H  3.33485 -0.739138 2.252113
H  1.842031 -1.086458 0.206251
H  1.354299 -1.994057 1.674417
H  5.744514 1.413896 0.072582
H  5.227773 0.322663 1.380165
H  4.233092 1.666428 -1.794636
H  3.488473 2.876645 -0.723812
H  -0.091814 0.325218 1.932026
H  5.345939 -0.490274 -1.609273
H  4.928713 -1.567313 -0.218566
H  2.021072 0.56165 -2.188624
H  1.211667 1.707735 -1.088042
H  1.941769 2.305665 -2.602469
H  0.18327 -2.324819 -0.676169
H  -1.713677 1.471889 1.917205
H  -1.696956 -2.917706 -2.184969
H  -5.244554 -0.169314 -1.257547
H  -3.932931 2.55077 1.888942
