program: Gaussian 09
title: 000145720
version: EM64L-G09RevD.01
frameworkgroup: C1[X(C11H7N3O3)]
method: RPBEPBE
basis: SDD
operation: Freq
keyword: #p
keyword: freq=noraman
keyword: PBEPBE/SDD
title: #p freq=noraman PBEPBE/SDD
converged: NO YES NO NO
title: Mulliken charges:
elementType: O O O N N N C C C C C C C C C C C H H H H H H H
charge: -0.246475 -0.214872 -0.207992 -0.446178 -0.039265 0.051214 0.300440 0.049532 0.029074 0.326140 -0.357546 -0.336567 -0.334803 0.269467 -0.309850 -0.204364 -0.226899 0.344975 0.243750 0.293937 0.256341 0.295592 0.231350 0.232997
chargesum: 0.00000
title: Mulliken charges with hydrogens summed into heavy atoms:
elementType: O O O N N N C C C C C C C C C C C
charge: -0.246475 -0.214872 -0.207992 -0.101203 -0.039265 0.051214 0.300440 0.049532 0.029074 0.326140 -0.113796 -0.080225 -0.040866 0.269467 -0.014257 0.026985 0.006098
polarizability: 3.77766609e+02 2.82312345e+00 1.58341898e+02 -1.29959287e-03 4.33387422e-04 5.68522373e+01
1716.lowfreq: -3.7607 -3.1442 -0.0009 -0.0002 0.0003 2.4868 47.1978 55.0552 59.2645
frequency: 47.1792 55.0541 59.2638 90.2071 149.4517 185.3326 229.8804 254.2823 267.7192 341.2820 345.1377 438.3646 439.3275 486.7831 556.2411 560.3053 572.0776 584.7811 613.5059 628.3589 654.4573 674.9266 706.8479 732.0623 759.4515 770.5247 783.9261 824.9004 861.2393 876.1753 884.3757 910.9288 915.4654 941.5949 944.9501 984.1172 1004.3565 1018.6765 1086.4603 1116.6705 1130.9898 1160.7416 1189.7659 1222.2393 1234.2694 1259.4316 1271.8805 1295.7165 1330.8924 1342.8866 1372.6747 1412.1659 1424.6376 1451.2025 1482.7567 1519.3397 1581.3468 1623.1642 1636.7643 3137.8133 3150.9113 3164.7284 3177.3456 3243.7003 3260.8092 3586.5893
redmass: 6.1290 8.1300 7.7344 6.5923 8.5233 8.3523 6.1881 4.6634 9.7511 5.6382 5.7317 8.2338 3.0951 8.0869 5.8137 5.6139 3.5709 8.5709 6.4814 5.1790 1.1574 8.8385 5.9641 12.8931 1.4530 3.1500 5.2451 1.3252 1.4976 8.6143 5.6390 1.3776 8.2655 7.1340 1.3755 1.3150 2.0907 1.2849 3.5385 1.6184 5.8930 1.1687 2.0744 2.8038 1.9349 3.2982 3.4265 4.0207 2.6737 8.4893 4.4629 2.7994 4.3886 4.8524 3.2391 6.5659 6.3082 8.5404 7.9143 1.0859 1.0904 1.0963 1.0994 1.0951 1.1047 1.0819
irintensity: 2.8996 3.6871 4.7089 5.0417 0.1205 1.2082 0.0163 6.6283 0.6144 2.6894 0.4034 2.8874 12.8391 1.9737 5.8447 0.9487 1.8051 1.2022 3.7944 0.6138 80.4685 15.0145 0.5478 14.4176 122.3648 18.4134 7.0554 62.8159 0.0112 9.6272 0.2113 1.3021 9.5952 5.2155 4.1496 0.0036 4.1854 35.2901 8.3973 8.3067 196.8790 12.5346 0.7025 13.8492 173.2487 94.6245 281.5839 10.9391 110.9532 32.3321 94.9453 7.8786 14.9308 168.1846 19.7839 130.8180 1.0606 104.2214 27.7086 1.0959 6.9746 18.5216 27.1104 0.4603 8.4408 54.6686
temp: 298.150 k
press: 1.00000 atm
elementType: 8 8 8 7 7 7 6 6 6 6 6 6 6 6 6 6 6 1 1 1 1 1 1 1
symmnumber: 1
zpe: 436765.0 jmol-1
zpe.correction: 0.166355 hartree
zpe.thermalcorrener: 0.179162 hartree
zpe.thermalcorrenthalpy: 0.180106 hartree
zpe.thermalcorrgfe: 0.125659 hartree
zpe.sumelectzpe: -812.027208 hartree
zpe.sumelectthermal: -812.014401 hartree
zpe.sumelectthermalent: -812.013457 hartree
zpe.sumelectthermalfe: -812.067904 hartree
dipole: -4.7988 0.9209 0.0002
dipole: 4.8863
quadrupole: -108.8935 -91.0371 -99.5284
quadrupole: 18.1885 0.0006 0.0002
quadrupole: -9.0739 8.7826 0.2913 18.1885 0.0006 0.0002
hfenergy: -812.1935628 hartree
pointgroup: C01 [X(C11H7N3O3)]
dipole: -1.8859977 0.372501 -0.0001658 debye
dipolederiv: -0.0678398 -0.1308865 0.0000214 0.0143859 -0.5202037 0.0000895 0.0000056 0.0000915 -0.0881294 -1.426928 0.0026591 -0.0001465 -0.2004284 -0.4298106 0.0000023 0.0001068 0.0000678 -0.2402109 -0.410431 -0.0245884 0.0000094 0.5914158 -0.8642964 0.0002532 -0.0000786 0.0000722 -0.2283151 -0.2303241 0.0047001 0.0000073 0.2011793 -0.4725876 0.000064 -0.0000311 0.0000394 -0.2550276 0.2396212 0.1365022 0.0000158 -0.0936472 -0.3174794 0.0000028 0.0000756 0.0000278 -0.2525252 2.3875685 -0.3108063 0.0002762 -1.1466811 1.3550453 -0.0003874 0.0002732 -0.0002975 0.2057857 -0.0094927 -0.0516123 -0.0000169 0.0882559 -0.094209 0.0000478 -0.0000468 0.0000374 0.086224 -0.5935777 -0.0128339 -0.0000482 0.1756935 0.5890102 -0.0000881 -0.0001124 -0.0001074 0.10283 -0.2251883 -0.0097041 -0.0000206 -0.2238789 -0.0361377 -0.000006 0.0000476 0.0000171 0.0262552 1.1755486 0.084853 0.0000713 0.586868 0.2140961 0.0000258 -0.0000605 -0.0000223 0.0661074 0.0672 0.1031998 -0.000002 0.1231502 0.093805 -0.0000537 -0.0000193 -0.0000564 -0.1859624 0.4614665 0.029425 0.0000428 -0.0803278 0.1220573 -0.0000691 0.0000566 -0.0000561 -0.1451959 -0.8492138 0.0494042 -0.0000751 -0.5237022 0.0247172 -0.0000852 0.0000022 -0.0000448 -0.1593987 -1.0454097 0.3122541 -0.0001426 1.2506109 -0.2432439 0.0001711 -0.0003528 0.0001402 0.0767806 0.5420027 -0.0809963 0.000071 -0.5338243 0.1724392 -0.0001038 0.0001194 -0.0000517 -0.1072925 -0.2883904 -0.0333025 -0.0000076 0.331594 0.1604061 -0.0000468 -0.0000788 -0.0000771 -0.1536766 -0.0614461 -0.0941314 0.0000249 -0.6181934 -0.1489708 -0.000058 0.0001515 -0.0000125 -0.172706 0.1861161 -0.0097645 -0.0000098 0.0101139 0.215853 0.0000333 -0.0000129 0.0000295 0.3546987 0.0711693 0.0511285 -0.0000193 -0.0181664 -0.0712263 0.0000574 -0.0000026 0.0000617 0.18291 0.1004094 0.0524834 -0.0000163 0.0505443 0.0859105 0.0000285 0.0000101 0.0000348 0.19367 0.089897 0.0078359 -0.0000072 0.0674829 -0.0439733 0.0000545 -0.0000207 0.0000456 0.167848 0.0744601 -0.0305104 -0.0000032 0.0014049 0.1342861 0.000012 -0.0000093 0.0000036 0.1972057 -0.0502984 -0.1023454 0.000009 -0.1071345 0.0039857 0.00003 0.0000092 0.00003 0.1624424 -0.1369197 0.0570367 -0.0000338 0.0532846 0.0705272 0.000026 -0.0000319 0.0000271 0.1656825 unknown
polarizability: 377.7907189|1.6366711|158.3177812|0.0253764|-0.0225561|56.8522444 unknown
InChI: InChI=1S/C11H7N3O3/c15-14(16)10-6-5-9(17-10)11-12-7-3-1-2-4-8(7)13-11/h1-6,12H
charge 0 multiplicity 1
24 atoms
O  1.834397 -0.389075 0.000263
O  5.419838 -0.296653 0.000542
O  3.95403 -2.075517 0.00085
N  -0.936263 -0.839216 0.000123
N  -1.400156 1.409903 -0.000406
N  4.224428 -0.80893 0.000722
C  -2.330282 -0.739526 0.000019
C  -0.427172 0.468341 -0.000105
C  -2.601282 0.678973 -0.000337
C  0.985963 0.739542 -0.000045
C  -3.358653 -1.704666 0.00018
C  -3.939083 1.14427 -0.00054
C  1.750033 1.911744 -0.000174
C  3.141146 0.124914 0.000307
C  3.125652 1.5177 -0.000032
C  -4.681174 -1.216345 -0.000022
C  -4.967416 0.184145 -0.000376
H  -0.369266 -1.687042 0.000331
H  -3.151949 -2.779367 0.000444
H  1.34258 2.919433 -0.000409
H  -4.148578 2.217693 -0.000801
H  4.00591 2.15506 -0.000103
H  -5.51355 -1.928299 0.000088
H  -6.012553 0.510819 -0.000519
