program: Gaussian 09
title: 000145722
version: EM64L-G09RevD.01
frameworkgroup: C1[X(C11H9N5O5)]
method: RPBEPBE
basis: SDD
operation: Freq
keyword: #p
keyword: freq=noraman
keyword: PBEPBE/SDD
title: #p freq=noraman PBEPBE/SDD
converged: YES YES NO NO
title: Mulliken charges:
elementType: O O O O O N N N N N C C C C C C C C C C C H H H H H H H H H
charge: -0.217848 -0.202333 -0.272488 -0.216327 -0.190296 -0.427435 -0.416733 0.001331 -0.069204 0.048967 0.398270 0.017055 -0.316728 -0.227313 -0.355256 0.298987 0.271445 -0.304892 -0.015420 0.266171 -0.762596 0.279514 0.306948 0.272337 0.295483 0.403957 0.361881 0.270028 0.269930 0.232563
chargesum: 0.00000
title: Mulliken charges with hydrogens summed into heavy atoms:
elementType: O O O O O N N N N N C C C C C C C C C C C
charge: -0.217848 -0.202333 -0.272488 -0.216327 -0.190296 -0.023478 -0.054852 0.001331 -0.069204 0.048967 0.398270 0.017055 -0.037214 0.079635 -0.082919 0.298987 0.271445 -0.009408 -0.015420 0.266171 0.009925
polarizability: 4.84768844e+02 -4.65367040e-01 1.89079453e+02 5.99569439e-02 2.33051684e-02 7.19742347e+01
1716.lowfreq: -45.1004 -5.9276 -0.0011 -0.0008 -0.0002 0.3543 1.1268 18.8584 32.2032
frequency: -44.9327 18.8452 32.1987 35.8340 54.5196 80.0052 91.3287 92.1420 126.6379 166.1085 174.8301 176.0741 195.7038 233.5219 260.5847 314.9044 330.2019 338.4594 388.1185 410.3281 432.0679 465.3402 503.0823 523.9902 544.0551 563.0662 584.5733 587.4526 632.3747 654.4780 664.5148 679.4019 714.8274 734.5363 739.6770 775.2790 783.7034 810.5230 847.6583 900.3556 903.8936 907.3372 914.0258 921.1693 924.3670 991.4181 999.3324 1004.6518 1026.2170 1044.5447 1054.3597 1129.9294 1171.2985 1195.3513 1210.5658 1219.3444 1228.2517 1275.9381 1282.0066 1292.7110 1310.0178 1347.1874 1377.7358 1394.3017 1410.7125 1446.6726 1450.4203 1469.7042 1489.6346 1494.0203 1541.6707 1561.6878 1608.4412 1616.4624 1632.8048 3005.4971 3101.0075 3114.6971 3134.7822 3154.8996 3229.1562 3260.1121 3329.1604 3523.8516
redmass: 1.0304 7.9604 5.8523 8.2409 9.8468 10.3288 8.9308 5.4889 6.3595 8.5020 6.4017 3.8149 7.7777 5.3582 7.1880 11.5038 3.1188 4.2596 7.8835 8.4824 7.1766 8.0648 6.9948 4.7257 8.4898 5.3963 3.3723 8.9542 6.7734 3.7140 2.6580 8.4706 9.1395 1.7602 10.3499 6.6432 6.6351 1.3838 4.5135 1.3756 1.1547 9.1628 1.8012 6.1355 5.9283 4.8061 1.8649 1.1056 1.2540 1.6482 4.2667 4.0047 2.6208 4.4128 2.6752 2.3124 2.7305 1.8512 2.4826 2.4957 3.4514 10.7320 3.6544 1.2492 4.5772 1.0459 2.5507 1.2182 5.7739 4.4672 6.0691 4.2459 5.6557 5.6340 6.0503 1.0363 1.0974 1.1018 1.0931 1.0888 1.0963 1.1030 1.0848 1.0779
irintensity: 0.2834 0.0040 4.7510 0.9501 3.1587 4.1661 1.7020 0.3001 4.6260 0.1647 19.0143 0.4932 0.9622 2.4610 2.2240 1.4713 0.6779 4.3530 3.8786 2.9188 1.6779 3.5130 7.0729 8.9888 22.9705 1.3756 1.4853 6.1873 0.3947 6.7917 15.5199 11.3210 2.3513 82.3424 31.0926 26.3371 7.5693 46.3468 5.6822 49.1155 59.6636 12.3737 0.3710 5.2825 1.8930 16.4679 8.5327 61.7549 31.5776 19.9022 29.1411 64.9543 117.0614 221.5303 133.7953 29.4884 283.8485 78.8857 299.6128 13.1435 17.6073 106.6743 5.7453 163.8683 677.8562 19.0465 40.2884 37.8060 47.9636 503.7358 12.7044 642.3089 168.3089 92.7410 8.9749 3.0928 2.5170 12.2311 1.0927 16.3166 0.6279 4.9924 497.9490 58.1114
temp: 298.150 k
press: 1.00000 atm
elementType: 8 8 8 8 8 7 7 7 7 7 6 6 6 6 6 6 6 6 6 6 6 1 1 1 1 1 1 1 1 1
symmnumber: 1
zpe: 534507.4 jmol-1
zpe.correction: 0.203583 hartree
zpe.thermalcorrener: 0.221538 hartree
zpe.thermalcorrenthalpy: 0.222482 hartree
zpe.thermalcorrgfe: 0.154534 hartree
zpe.sumelectzpe: -1072.827961 hartree
zpe.sumelectthermal: -1072.810006 hartree
zpe.sumelectthermalent: -1072.809062 hartree
zpe.sumelectthermalfe: -1072.877010 hartree
dipole: -9.5846 -6.3482 0.0134
dipole: 11.4962
quadrupole: -103.3110 -133.5187 -119.0879
quadrupole: -28.7081 -0.0717 0.0180
quadrupole: 15.3282 -14.8795 -0.4487 -28.7081 -0.0717 0.0180
hfenergy: -1073.031544 hartree
pointgroup: C01 [X(C11H9N5O5)]
dipole: -3.6689821 -2.1511161 -1.5390041 debye
polarizability: 484.2626868|12.4603131|147.4206134|2.0256024|56.3157497|114.1392311 unknown
InChI: InChI=1S/C11H9N5O5/c1-6(17)12-11-13-10(18)8(14-15-11)4-2-7-3-5-9(21-7)16(19)20/h2-5,12,15H,1H3
charge 0 multiplicity 1
30 atoms
O  3.440235 0.058348 0.233539
O  -0.975111 1.980317 1.74642
O  -5.392016 -1.755045 -0.967632
O  7.01451 0.302701 0.357701
O  5.388138 1.595183 1.352559
N  -2.978121 -0.847541 -0.332923
N  -5.053274 0.089141 0.414598
N  -1.603943 -0.904047 -0.40137
N  -3.043452 1.068131 1.108208
N  5.7760 0.611814 0.609965
C  2.705948 -0.916771 -0.485335
C  -0.932455 0.035602 0.291777
C  1.272144 -0.885366 -0.438424
C  0.524579 0.031821 0.263475
C  3.607974 -1.774984 -1.142327
C  -3.641572 0.11559 0.404816
C  4.786633 -0.228063 -0.002203
C  4.93212 -1.336219 -0.834285
C  -1.622192 1.107714 1.107801
C  -5.878187 -0.820786 -0.254193
C  -7.369527 -0.621524 -0.075127
H  0.760439 -1.664732 -1.015768
H  1.002089 0.824256 0.850897
H  3.329266 -2.619093 -1.769966
H  5.877693 -1.757416 -1.164449
H  -3.531375 -1.551959 -0.851615
H  -5.455752 0.837977 0.986538
H  -7.807864 -1.543223 0.344413
H  -7.832945 -0.465136 -1.064412
H  -7.625682 0.22761 0.579022
