program: Gaussian 09
title: 000145718
version: EM64L-G09RevD.01
frameworkgroup: C1[X(C5H12N2)]
method: RPBEPBE
basis: SDD
operation: Freq
keyword: #pfreq=noraman
keyword: PBEPBE/SDD
title: #p freq=noraman PBEPBE/SDD
converged: YES YES NO NO
title: Mulliken charges:
elementType: N N C C C C C H H H H H H H H H H H H
charge: -0.108993 -0.065052 -0.408063 -0.422427 -0.324765 -0.616644 -0.624988 0.210462 0.240180 0.242389 0.214472 0.234196 0.142056 0.226723 0.224314 0.184201 0.256955 0.220310 0.174673
chargesum: 0.00000
title: Mulliken charges with hydrogens summed into heavy atoms:
elementType: N N C C C C C
charge: -0.108993 -0.065052 0.042579 0.034435 0.051488 0.018594 0.026950
polarizability: 8.16190611e+01 2.69842027e-01 6.74122382e+01 2.39333159e-01 5.06868689e-01 5.45504746e+01
1716.lowfreq: -21.0622 -0.0007 -0.0005 0.0005 11.1519 18.5726 60.4172 98.5861 176.6958
frequency: 60.1165 98.5733 176.6846 235.7624 240.7679 294.2955 332.4567 358.7113 402.8963 480.5450 725.7294 793.8385 812.7095 833.4102 972.7689 985.6354 1032.6412 1046.9443 1050.8563 1063.1682 1076.4396 1092.1574 1114.4297 1139.1603 1143.5677 1205.7074 1257.5720 1272.6350 1287.2823 1378.1426 1414.3892 1439.7218 1450.8737 1457.7146 1461.1229 1470.4102 1473.2079 1480.5778 1487.5894 2670.7472 2830.1900 2848.4553 3015.7648 3018.6146 3035.8767 3047.4700 3056.8956 3076.4800 3100.6647 3162.1953 3179.3676
redmass: 2.6145 2.6225 2.5327 1.0933 1.1150 2.6762 2.5938 2.5422 2.0098 2.8368 2.8421 2.0058 2.8178 2.9527 1.1628 1.8697 1.4338 1.8371 1.8453 1.2773 1.3022 1.2816 1.5712 1.5280 1.5360 1.9427 3.7587 2.2890 1.7659 1.2596 1.1415 1.1615 1.0797 1.0764 1.0581 1.1340 1.0993 1.0596 1.0562 1.0689 1.0583 1.0581 1.0708 1.0851 1.0716 1.0512 1.0630 1.1008 1.0997 1.1131 1.1145
irintensity: 2.6688 0.6267 2.6608 1.0598 0.4786 7.4226 1.0595 1.2242 5.5087 2.1964 13.8544 3.9963 1.1141 21.7730 2.3951 16.6491 29.0245 21.7173 61.5808 5.0035 11.1985 7.3321 18.0994 5.7557 4.4025 11.7413 49.7021 14.3376 1.5944 40.9247 3.6323 14.0148 3.8400 5.5922 18.0302 1.3483 6.4784 22.3237 22.7886 150.9018 80.9864 206.8590 44.5440 34.9835 39.6287 37.6367 33.8721 34.9399 26.1404 2.1385 40.0042
temp: 298.150 k
press: 1.00000 atm
elementType: 7 7 6 6 6 6 6 1 1 1 1 1 1 1 1 1 1 1 1
symmnumber: 1
zpe: 437497.9 jmol-1
zpe.correction: 0.166634 hartree
zpe.thermalcorrener: 0.175091 hartree
zpe.thermalcorrenthalpy: 0.176035 hartree
zpe.thermalcorrgfe: 0.133840 hartree
zpe.sumelectzpe: -306.555351 hartree
zpe.sumelectthermal: -306.546894 hartree
zpe.sumelectthermalent: -306.545950 hartree
zpe.sumelectthermalfe: -306.588145 hartree
dipole: -0.1054 -0.1537 2.3663
dipole: 2.3736
quadrupole: -40.7115 -41.6578 -48.7418
quadrupole: 0.1324 -0.0154 -0.5050
quadrupole: 2.9922 2.0459 -5.0381 0.1324 -0.0154 -0.5050
hfenergy: -306.7219851 hartree
pointgroup: C01 [X(C5H12N2)]
dipole: 0.0601144 -0.071305 -0.9291819 debye
dipolederiv: -0.8305601 -0.1299843 0.0549366 -0.2138125 -0.102393 -0.031243 0.0307784 -0.0294848 -0.3567273 -0.7478 -0.0136897 -0.0040363 0.05288 -0.5164523 0.0127027 0.0582687 -0.0145534 -0.5894913 0.1455496 -0.0009547 0.0608397 0.047505 -0.0137022 0.0272277 0.0389 0.0338893 0.2104432 0.1241471 0.0696233 0.0185004 0.0609358 0.0393742 0.0969882 -0.0077117 0.0836582 0.1487628 1.0655188 -0.0643331 -0.0887797 -0.0886647 0.2583478 0.0231861 -0.0022755 0.0533545 0.5946664 0.3729419 0.1519902 0.1089904 0.223047 0.1787331 0.0372862 0.097213 0.0552273 0.4119933 0.0397043 -0.0291004 -0.0276854 -0.0556553 0.3850947 -0.11204 0.0048376 -0.1115623 0.3760627 0.0393334 0.0143065 -0.0434394 0.0542739 -0.0114786 -0.1114007 0.0531996 -0.1470616 -0.0548207 -0.0650694 0.0635216 -0.0862635 0.0784888 0.0620325 0.0007057 -0.1185217 0.0205675 0.0158582 0.0733747 -0.0648736 -0.0300372 -0.101635 -0.0837442 -0.0359488 -0.0453622 -0.0581821 0.0443353 0.0773863 -0.0119125 -0.0968391 -0.0148914 0.0309318 0.0203094 -0.034349 0.0894872 -0.1264776 0.0048055 -0.0229638 0.0140711 -0.0204265 -0.1665382 0.0366687 0.0073219 0.0489379 0.0489147 -0.1823783 0.0244478 0.0343435 -0.0102507 0.0103341 0.0351133 0.0652222 -0.1170093 -0.3618037 -0.1371245 0.0476692 0.0615054 0.1339538 0.0620504 -0.055323 0.0695768 -0.0562854 0.0485563 0.1051251 0.0341337 -0.0293218 -0.0552221 -0.1705177 0.0673958 -0.0292947 0.0715875 0.0576692 -0.0353267 -0.055081 0.0054016 -0.061309 0.0362529 0.0180292 -0.189156 -0.0839389 -0.2988804 0.00604 -0.1497647 -0.0773052 -0.115256 0.0273251 -0.0243732 -0.0776242 -0.0191903 0.0416 -0.1241313 0.1497738 0.0869932 0.0749767 0.0388097 -0.010907 0.079065 -0.0125469 0.0628807 0.0684638 -0.0128085 0.0381256 0.0110622 -0.0644603 0.0056229 -0.0000885 0.1931055 -0.2735417 unknown
polarizability: 81.6043294|-0.0611182|67.3932372|0.76597|-0.6624643|54.5842073 unknown
InChI: InChI=1S/C5H12N2/c1-6(2)5-7-3-4-7/h3-5H2,1-2H3
charge 0 multiplicity 1
19 atoms
N  1.076282 -0.116729 0.513049
N  -1.353064 -0.051928 0.239987
C  2.402951 -0.594458 -0.026984
C  1.921686 0.814166 -0.328568
C  -0.107503 -0.717611 -0.162724
C  -2.543162 -0.779448 -0.235336
C  -1.385481 1.386642 -0.076805
H  2.396617 -1.311985 -0.86077
H  3.177968 -0.768232 0.72555
H  2.348647 1.667832 0.206697
H  1.59273 1.021824 -1.357196
H  -0.171067 -1.775546 0.15504
H  0.024588 -0.705353 -1.292156
H  -3.451616 -0.310149 0.182251
H  -2.508209 -1.826235 0.118062
H  -2.648678 -0.795136 -1.351535
H  -0.548169 1.89227 0.430175
H  -2.327535 1.823415 0.298974
H  -1.319685 1.601563 -1.17621
