program: Gaussian 09
title: 000145717
version: EM64L-G09RevD.01
frameworkgroup: C1[X(C6H4N2O3S)]
method: RPBEPBE
basis: SDD
operation: Freq
keyword: #p
keyword: freq=noraman
keyword: PBEPBE/SDD
title: #p freq=noraman PBEPBE/SDD
converged: YES YES NO NO
title: Mulliken charges:
elementType: S O O O N N C C C C C C H H H H
charge: 0.319926 -0.194473 -0.201267 -0.178867 0.051481 0.029637 0.430107 -0.324715 -0.766890 0.282215 -0.292222 -0.359349 0.280629 0.318983 0.305495 0.299311
chargesum: 0.00000
title: Mulliken charges with hydrogens summed into heavy atoms:
elementType: S O O O N N C C C C C C
charge: 0.319926 -0.194473 -0.201267 -0.178867 0.051481 0.029637 0.430107 -0.044086 -0.142412 0.282215 0.007089 -0.359349
polarizability: 2.01310493e+02 2.37581438e+00 9.37381882e+01 -1.12978460e+01 -3.48462683e+00 6.03659854e+01
1716.lowfreq: -8.5442 -2.4769 -0.0007 0.0018 0.0024 3.1207 16.5456 36.6874 51.7860
frequency: 16.4853 36.6176 51.7855 87.7646 126.2296 166.4546 180.8329 295.5029 322.4098 377.0104 395.4814 421.6873 509.8170 559.4452 570.5465 630.6262 667.7075 688.5894 719.1681 742.4801 827.5305 860.1727 906.6415 927.7696 929.1303 1023.2470 1095.3811 1135.8020 1208.8641 1219.8718 1233.7300 1278.5494 1355.4882 1371.3543 1432.9264 1496.8934 1568.3649 2097.8712 3070.6631 3157.4525 3233.2807 3260.8191
redmass: 12.4631 7.9891 13.7850 7.7802 9.8736 6.1345 7.7339 6.8503 3.2607 12.6563 9.6056 9.8930 6.7532 9.6774 4.8609 12.8100 5.4132 8.3172 5.9241 8.9507 1.3310 1.7707 1.4024 6.0943 5.1398 1.2556 1.3046 5.9492 3.4749 1.6444 1.2328 5.6955 5.6509 5.1861 1.1515 7.9969 6.5687 12.7196 1.0574 1.1106 1.0971 1.1033
irintensity: 4.4251 2.7612 1.6338 0.1032 5.5663 0.0558 1.4201 3.2471 5.0303 0.1710 2.5964 8.5856 0.3417 15.2842 0.8152 1.9472 13.7471 11.2398 8.1352 24.5211 59.0684 1.5849 1.7706 5.7892 10.3265 34.7803 3.7628 21.5552 249.4112 1.5701 91.2393 69.0393 68.0180 76.4365 5.2992 70.4476 4.9320 26.2099 2.1472 0.1285 0.1968 6.7941
temp: 298.150 k
press: 1.00000 atm
elementType: 16 8 8 8 7 7 6 6 6 6 6 6 1 1 1 1
symmnumber: 1
zpe: 252761.6 jmol-1
zpe.correction: 0.096272 hartree
zpe.thermalcorrener: 0.107732 hartree
zpe.thermalcorrenthalpy: 0.108676 hartree
zpe.thermalcorrgfe: 0.055505 hartree
zpe.sumelectzpe: -963.257555 hartree
zpe.sumelectthermal: -963.246094 hartree
zpe.sumelectthermalent: -963.245150 hartree
zpe.sumelectthermalfe: -963.298322 hartree
dipole: -0.0265 4.7804 0.5426
dipole: 4.8112
quadrupole: -115.9967 -73.2517 -73.5924
quadrupole: 4.6216 1.4598 0.9422
quadrupole: -28.3831 14.3619 14.0212 4.6216 1.4598 0.9422
hfenergy: -963.3538266 hartree
pointgroup: C01 [X(C6H4N2O3S1)]
dipole: -0.0097305 -1.8727169 -0.2752632 debye
dipolederiv: -0.4111142 0.0799614 0.0334339 0.1176958 0.0475445 0.0313404 0.1135062 0.0000592 0.210115 -0.1331574 0.0667328 -0.0685953 0.0710055 -0.5484694 0.0738289 -0.006379 0.077924 -0.0895905 -0.9742379 0.0542898 -0.1104324 0.1055381 -0.4692618 0.0609739 -0.1562328 0.0476822 -0.2593775 -0.4684422 -0.0480405 -0.03133 -0.2238096 -0.7866757 0.0905415 -0.0155751 0.0841309 -0.2266601 1.8431595 0.2990711 0.1729032 0.593903 1.2996012 -0.1398941 0.216873 -0.1110874 0.2670974 -0.4107128 0.0328405 -0.0093611 -0.0006533 -0.1866323 -0.0003581 -0.1270357 0.0178721 -0.1916257 0.138602 -0.0075387 0.0285317 -0.1604898 0.2584922 -0.0812517 0.042269 -0.0475626 -0.041119 -0.3292906 0.0088118 -0.0245371 0.2156875 0.0500883 0.0035912 -0.0645274 -0.0318158 -0.158104 0.6339774 -0.1599601 -0.2248989 -0.2365816 0.1262785 0.0703694 -0.3889524 0.095819 0.21012 -0.6087056 -0.3150572 0.0327059 -0.7231547 -0.114299 -0.0914216 -0.0299609 -0.0290645 0.1126875 0.2207805 0.0538974 0.0670223 0.2275622 0.0889641 0.0317201 0.0242725 -0.0203721 -0.1016021 0.3298115 -0.0343309 0.1099663 0.023697 -0.0434147 -0.041087 0.279553 -0.061754 -0.144155 0.0885175 -0.0678269 -0.0137602 -0.0707298 0.068101 0.0110477 -0.0073615 0.0079916 0.180319 0.0054212 0.0093919 0.0447135 0.0470392 0.0461472 0.031203 0.086324 0.0145038 0.0058515 -0.0069804 -0.0013712 0.0199005 0.0046821 0.023846 -0.0635677 0.0636207 -0.0592257 0.0316961 0.0823717 0.029129 -0.0262622 0.0086085 0.1396897 0.0129641 -0.0303936 0.0148993 0.1943473 unknown
polarizability: 201.7558393|-2.4085833|93.9131252|8.0931518|-2.2834238|59.7457018 unknown
InChI: InChI=1S/C6H4N2O3S/c7-4-12-3-5-1-2-6(11-5)8(9)10/h1-2H,3H2
charge 0 multiplicity 1
16 atoms
S  -2.666825 0.274534 0.950322
O  0.618704 0.439052 -0.343687
O  4.106967 0.070908 0.38522
O  2.877442 1.94098 -0.147606
N  3.002531 0.677507 0.077329
N  -5.383713 0.495962 -0.150575
C  -0.329179 -0.608329 -0.376109
C  0.30108 -1.815461 -0.065329
C  -1.718674 -0.230079 -0.696787
C  1.83392 -0.161589 -0.013522
C  1.690103 -1.532383 0.163609
C  -4.267477 0.401979 0.279505
H  -0.183565 -2.787911 -0.009234
H  -1.772734 0.648902 -1.35434
H  -2.283075 -1.07533 -1.113568
H  2.485198 -2.226442 0.421772
