program: Gaussian 09
title: 000145716
version: EM64L-G09RevD.01
frameworkgroup: C1[X(C8H17N3)]
method: RPBEPBE
basis: SDD
operation: Freq
keyword: #pfreq=noraman
keyword: PBEPBE/SDD
title: #p freq=noraman PBEPBE/SDD
converged: YES YES NO NO
title: Mulliken charges:
elementType: N N N C C C C C C C C H H H H H H H H H H H H H H H H H
charge: -0.121081 -0.113500 -0.047380 -0.407268 -0.426421 -0.407456 -0.424870 -0.338425 -0.351552 -0.317432 -0.713827 0.211184 0.240004 0.241910 0.213904 0.211064 0.240871 0.243058 0.214200 0.267065 0.130811 0.246435 0.138330 0.250534 0.157592 0.208922 0.239910 0.213416
chargesum: 0.00000
title: Mulliken charges with hydrogens summed into heavy atoms:
elementType: N N N C C C C C C C C
charge: -0.121081 -0.113500 -0.047380 0.043920 0.029393 0.044479 0.032388 0.059452 0.033214 0.090694 -0.051579
polarizability: 1.25128901e+02 2.86517319e-01 1.14164240e+02 -1.41303602e+00 2.14247167e+00 8.26576050e+01
1716.lowfreq: -9.3663 -7.2283 -0.0007 -0.0004 0.0002 10.5719 54.1592 58.2287 70.1966
frequency: 53.9211 58.0040 69.9694 86.4715 107.8553 145.4956 172.5932 210.0321 261.2336 297.7870 321.1860 347.1262 373.2124 388.5796 472.4073 532.3443 715.6829 731.2443 789.7576 794.7988 795.5950 811.0237 826.5466 831.1506 961.9754 970.6589 975.5989 984.7297 1007.8787 1047.1029 1054.5064 1063.7926 1065.6458 1075.5500 1077.6408 1078.4010 1109.8381 1119.2543 1129.2006 1137.2939 1144.5305 1179.5260 1201.5455 1255.5325 1256.4568 1262.0110 1267.5317 1287.0557 1371.0247 1381.0675 1390.4926 1396.6586 1450.4119 1450.7894 1458.9057 1462.2703 1471.8265 1473.6834 1476.3126 1479.6076 1491.6755 2656.8224 2675.6090 2813.3525 2985.3115 3045.4311 3046.6360 3050.3143 3055.0378 3056.0806 3056.9828 3058.5572 3081.4068 3092.3580 3160.2170 3161.2546 3177.4449 3178.1164
redmass: 2.6145 2.8549 2.7265 2.7980 2.1333 2.9107 2.3006 2.4277 1.4875 3.4110 2.6950 3.0549 2.1230 2.0960 3.0876 3.6884 3.0178 2.6945 2.5531 1.6291 1.8344 1.2480 2.6740 2.6895 1.5543 1.1111 1.3475 1.7875 2.2546 1.5599 1.6718 1.3563 1.3543 1.4438 2.1290 1.3157 1.7302 1.8220 1.8245 1.4627 1.4951 2.5985 2.8006 1.5029 2.2688 1.6810 1.8970 1.1856 1.3150 1.2735 1.2751 1.2695 1.0842 1.0842 1.0945 1.1125 1.1448 1.0902 1.1026 1.0792 1.0633 1.0689 1.0679 1.0714 1.0359 1.0552 1.0522 1.0820 1.0782 1.0665 1.0644 1.0886 1.0950 1.1001 1.1135 1.1132 1.1148 1.1145
irintensity: 4.2795 2.3529 2.2685 0.2696 0.4163 1.6655 2.6811 1.0618 1.2195 1.4178 0.7117 1.8658 4.3215 5.9542 2.8066 6.3839 18.5118 8.3078 2.7420 3.4041 3.8618 5.4295 10.7021 2.8547 4.4931 0.1717 8.9409 30.0412 30.2330 4.0422 39.1655 5.9364 3.5554 7.9048 33.7446 14.3078 20.5109 22.3781 16.1747 9.6807 2.0682 55.2243 70.3784 62.8366 57.0588 2.1566 4.4638 21.4875 3.3922 37.8107 11.6360 19.6960 4.3141 2.8367 2.2275 0.3273 6.0413 3.7295 11.2487 2.6193 9.3443 46.2546 234.6899 135.7810 30.7553 17.3311 25.2887 44.1043 20.7541 32.5725 33.1554 4.3424 56.4330 32.1065 2.0699 1.6934 41.1079 39.4575
temp: 298.150 k
press: 1.00000 atm
elementType: 7 7 7 6 6 6 6 6 6 6 6 1 1 1 1 1 1 1 1 1 1 1 1 1 1 1 1 1
symmnumber: 1
zpe: 640079.5 jmol-1
zpe.correction: 0.243793 hartree
zpe.thermalcorrener: 0.256459 hartree
zpe.thermalcorrenthalpy: 0.257403 hartree
zpe.thermalcorrgfe: 0.204195 hartree
zpe.sumelectzpe: -478.253352 hartree
zpe.sumelectthermal: -478.240687 hartree
zpe.sumelectthermalent: -478.239742 hartree
zpe.sumelectthermalfe: -478.292951 hartree
dipole: 0.3622 -0.7640 3.4714
dipole: 3.5729
quadrupole: -62.5660 -63.7557 -73.6461
quadrupole: 0.9230 0.2072 0.6270
quadrupole: 4.0899 2.9002 -6.9902 0.9230 0.2072 0.6270
hfenergy: -478.4971459 hartree
pointgroup: C01 [X(C8H17N3)]
dipole: 0.1292313 0.2850414 -1.3703846 debye
polarizability: 125.1137226|0.388965|114.2366233|1.4316737|1.6815777|82.6004006 unknown
InChI: InChI=1S/C8H17N3/c1-2-9(7-10-3-4-10)8-11-5-6-11/h2-8H2,1H3
charge 0 multiplicity 1
28 atoms
N  -2.079521 0.440882 0.455782
N  2.157894 0.591861 0.44785
N  0.081225 -0.689397 0.229445
C  -2.940862 1.634894 0.136152
C  -3.137226 0.329967 -0.618572
C  3.535581 0.887077 -0.08991
C  2.378377 1.817573 -0.411391
C  -0.67196 0.558825 -0.006428
C  1.481324 -0.562799 -0.208005
C  -0.58722 -1.901568 -0.30836
C  0.058069 -3.216245 0.169452
H  -2.487238 2.468579 -0.419837
H  -3.640723 1.931846 0.923202
H  -3.982547 -0.322792 -0.378719
H  -2.806461 0.302459 -1.667073
H  3.915883 0.264598 -0.91327
H  4.280735 1.166625 0.660993
H  2.281389 2.775651 0.108833
H  1.994606 1.801227 -1.442014
H  -0.185447 1.349966 0.588877
H  -0.630154 0.864403 -1.101357
H  2.021501 -1.474486 0.098458
H  1.554502 -0.481052 -1.340183
H  -1.626676 -1.867339 0.057118
H  -0.626627 -1.888573 -1.43182
H  1.05352 -3.396522 -0.275367
H  0.164066 -3.203703 1.268458
H  -0.585013 -4.070856 -0.109915
