program: Gaussian 09
title: 000145715
version: EM64L-G09RevD.01
frameworkgroup: C1[X(C7H15N3)]
method: RPBEPBE
basis: SDD
operation: Freq
keyword: #pfreq=noraman
keyword: PBEPBE/SDD
title: #p freq=noraman PBEPBE/SDD
converged: YES YES NO NO
title: Mulliken charges:
elementType: N N N C C C C C C C H H H H H H H H H H H H H H H
charge: -0.115818 -0.109296 -0.041316 -0.407835 -0.422653 -0.405412 -0.424231 -0.338762 -0.344434 -0.640196 0.210276 0.240544 0.241329 0.212611 0.210843 0.241708 0.244529 0.213442 0.269349 0.129647 0.236680 0.141742 0.220560 0.173370 0.263324
chargesum: 0.00000
title: Mulliken charges with hydrogens summed into heavy atoms:
elementType: N N N C C C C C C C
charge: -0.115818 -0.109296 -0.041316 0.042986 0.031287 0.047139 0.033740 0.060234 0.033988 0.017058
polarizability: 1.17021585e+02 4.14855987e-01 9.69350932e+01 -1.19810851e+00 1.17206960e+00 7.33921251e+01
1716.lowfreq: -8.3099 0.0003 0.0005 0.0006 8.5204 19.7631 51.7268 65.6688 85.7735
frequency: 51.5157 65.3593 85.7383 94.7726 154.5559 185.9239 243.1686 285.6131 310.8646 327.1011 372.3646 382.2799 425.6891 526.8229 718.1167 734.3512 794.4856 796.0852 819.8016 829.4177 844.0105 968.9647 973.0106 979.6277 996.1030 1036.6656 1051.3702 1054.5329 1063.0298 1065.7958 1076.0993 1077.0107 1105.4112 1119.8602 1131.5846 1139.3291 1144.0894 1186.8139 1227.7906 1253.7682 1259.4454 1267.1881 1284.4995 1377.1173 1385.0286 1428.7472 1450.6111 1451.2052 1458.2890 1460.2023 1469.7936 1472.8618 1477.6888 1484.6997 2650.8513 2676.0696 2837.5451 3021.5971 3033.9892 3046.0235 3046.1040 3055.5410 3055.9985 3058.8607 3106.1508 3161.2465 3162.1246 3178.1607 3178.9373
redmass: 2.8207 2.5378 3.2370 2.9065 2.7756 2.9333 1.1871 2.9739 2.9083 2.4429 2.4708 2.0395 2.6973 3.6503 3.1057 2.6782 1.7791 1.8748 2.6119 2.5381 3.3956 1.1218 1.1278 1.8385 2.0422 1.6195 1.7276 1.7223 1.3083 1.3402 1.3084 1.3100 1.3913 1.8157 1.7625 1.4729 1.4621 2.3212 1.7904 1.7972 3.2108 2.4408 1.5933 1.2933 1.2428 1.1851 1.0802 1.0814 1.0978 1.0868 1.1234 1.1503 1.1118 1.0569 1.0686 1.0682 1.0586 1.0856 1.0721 1.0514 1.0520 1.0632 1.0629 1.0841 1.0984 1.1132 1.1131 1.1145 1.1144
irintensity: 2.2749 4.5391 0.4018 1.6054 1.0549 3.9880 0.8710 2.5867 1.0552 0.2322 3.1870 4.7109 5.9634 2.1529 18.0190 10.3686 3.0787 4.5861 3.0928 0.5042 21.1590 1.7204 4.3714 18.9379 20.5682 72.8329 38.1637 28.5251 4.1253 6.0900 8.4496 17.4392 12.2812 18.4093 11.8340 6.8749 2.1103 29.1403 53.7348 78.5043 24.9197 8.7102 2.5936 52.8145 11.5862 17.0032 2.3061 5.8512 0.9333 9.7138 2.1345 1.4759 14.4238 23.8584 60.7176 235.1332 144.5263 25.0670 45.1955 33.3714 34.6655 28.3773 41.9955 17.4965 19.1195 2.1583 1.6773 40.6813 39.2946
temp: 298.150 k
press: 1.00000 atm
elementType: 7 7 7 6 6 6 6 6 6 6 1 1 1 1 1 1 1 1 1 1 1 1 1 1 1
symmnumber: 1
zpe: 566404.7 jmol-1
zpe.correction: 0.215732 hartree
zpe.thermalcorrener: 0.227010 hartree
zpe.thermalcorrenthalpy: 0.227955 hartree
zpe.thermalcorrgfe: 0.178198 hartree
zpe.sumelectzpe: -439.029756 hartree
zpe.sumelectthermal: -439.018478 hartree
zpe.sumelectthermalent: -439.017533 hartree
zpe.sumelectthermalfe: -439.067290 hartree
dipole: 0.3898 -0.3843 3.6821
dipole: 3.7226
quadrupole: -55.8649 -57.3675 -67.8994
quadrupole: 1.1112 0.0791 1.0069
quadrupole: 4.5124 3.0098 -7.5221 1.1112 0.0791 1.0069
hfenergy: -439.245488 hartree
pointgroup: C01 [X(C7H15N3)]
dipole: 0.1670645 0.1831881 -1.44345 debye
dipolederiv: -0.8257266 0.2467515 -0.0298633 0.1914266 -0.1544036 0.1100286 -0.0391497 0.1120744 -0.3258344 -0.552312 -0.3389516 0.0683492 -0.4689395 -0.4013283 0.0006203 0.0636197 -0.0118006 -0.3454334 -0.8190178 -0.0499909 -0.0094987 0.0892932 -0.5871617 0.0001887 0.043149 0.0399919 -0.547265 0.1578071 -0.0741576 -0.0839276 -0.0324312 0.0214724 -0.0285351 -0.0608475 -0.0451703 0.1882701 0.1852439 0.0265218 -0.0556367 0.0049867 0.0333669 -0.0926426 -0.0251403 -0.0929706 0.1110214 0.098815 0.0541816 0.0346196 0.1110414 0.0492619 0.05842 0.0096534 0.053286 0.2113702 0.0454324 0.0705641 -0.0319078 0.0853908 0.113096 0.0966929 -0.0569369 0.0746626 0.1361575 0.7950976 -0.3286091 0.0189128 -0.4193225 0.4486324 -0.1154289 -0.0471731 -0.0910292 0.5287969 1.0270294 0.2542164 -0.0888663 0.3224414 0.3633103 -0.0100087 -0.0400967 0.0339615 0.5760661 0.0870843 0.1267061 0.095204 0.1785881 0.3516616 0.0750749 0.0471602 0.1048197 0.378634 0.0435983 -0.0588025 0.0949016 0.0019195 -0.0667286 0.0697902 0.0360815 0.1390871 0.0000551 0.0026293 0.0740087 0.0875196 0.0880424 -0.0094021 -0.0396679 0.1106772 -0.0747773 0.0168498 -0.0563054 -0.0986152 0.015469 -0.1402078 0.0227346 -0.0052345 0.0344495 0.0123102 0.0575429 0.0449628 -0.0270051 0.0903101 -0.0201472 0.074184 -0.0340637 -0.0002132 -0.0605391 -0.1397636 -0.0060423 0.020115 0.0137927 0.0662897 0.0221563 -0.1185943 0.1211729 -0.1062736 -0.0444057 -0.0980563 -0.0219903 -0.0741123 -0.0106572 0.0906789 -0.0432253 -0.1151147 -0.04025 0.018202 0.1124104 0.0435687 -0.009071 0.0018598 -0.1145788 -0.0390145 -0.014218 -0.0644633 0.0482444 0.0860299 0.0105744 -0.0958383 0.0112217 0.0280374 -0.0343368 -0.0770855 0.0545837 -0.1265 0.0445977 -0.0439195 -0.0267836 -0.0750415 -0.0743792 -0.0339079 -0.037723 -0.0408506 0.0385335 -0.1367732 0.0710463 0.0109967 0.0649465 -0.0658105 0.0411342 0.0442814 0.1735381 -0.3185544 -0.0331684 0.0607916 -0.0125149 0.0678342 -0.1333112 0.0362912 -0.017767 0.0473761 0.0501656 -0.1584896 -0.0466486 0.009128 -0.1035436 -0.0255814 0.0413897 0.1339573 -0.0827471 -0.3499083 0.0312148 0.1753265 -0.0575657 0.0874788 -0.1042292 0.0397357 -0.0570068 0.0377265 0.0656795 0.0291886 -0.0602708 -0.0233442 -0.0571192 -0.027649 0.0341815 -0.1142943 -0.155583 -0.2803282 -0.1052502 -0.0854114 0.0597271 -0.0453513 0.1459707 -0.0088877 0.0585645 -0.0169633 0.0524041 unknown
polarizability: 116.9978715|-0.2959398|96.8688775|1.6327721|1.6777396|73.4820546 unknown
InChI: InChI=1S/C7H15N3/c1-8(6-9-2-3-9)7-10-4-5-10/h2-7H2,1H3
charge 0 multiplicity 1
25 atoms
N  -2.07717 0.270197 0.475021
N  2.173264 0.192852 0.48672
N  0.022581 -0.956461 0.264249
C  -2.92441 1.436677 0.035728
C  -3.167614 0.055455 -0.550109
C  3.571589 0.392147 -0.043394
C  2.477706 1.386167 -0.393299
C  -0.682569 0.299578 -0.0376
C  1.430666 -0.926942 -0.156573
C  -0.67135 -2.170672 -0.201754
H  -2.470811 2.185921 -0.629632
H  -3.594609 1.842771 0.799365
H  -4.017468 -0.54461 -0.210376
H  -2.869038 -0.104148 -1.596595
H  3.919443 -0.267633 -0.851969
H  4.325886 0.638092 0.70997
H  2.435252 2.357904 0.108262
H  2.103785 1.373599 -1.427759
H  -0.14828 1.111647 0.483842
H  -0.664825 0.522578 -1.153836
H  1.897129 -1.873522 0.17465
H  1.528207 -0.874179 -1.288384
H  -0.10778 -3.06294 0.124737
H  -0.787703 -2.223646 -1.316302
H  -1.67158 -2.209931 0.256339
