program: Gaussian 09
title: 000145765
version: EM64L-G09RevD.01
frameworkgroup: C1[X(C19H24N2)]
method: RPBEPBE
basis: SDD
operation: Freq
keyword: #pfreq=noraman
keyword: PBEPBE/SDD
title: #p freq=noraman PBEPBE/SDD
converged: YES YES NO NO
title: Mulliken charges:
elementType: N N C C C C C C C C C C C C C C C C C C C H H H H H H H H H H H H H H H H H H H H H H H H
charge: -0.226742 -0.311620 0.031853 0.346692 0.341707 0.179632 0.193556 -0.780674 -0.705041 -0.481181 -0.389053 -0.387468 -0.421695 -0.387435 -0.347192 -0.293257 -0.290220 -0.269963 -0.268269 -0.377694 -0.619687 0.233238 0.214071 0.213373 0.217937 0.239176 0.216964 0.229147 0.265935 0.229417 0.229992 0.220699 0.237910 0.282051 0.233955 0.222058 0.223070 0.220078 0.221082 0.205727 0.202346 0.259415 0.224046 0.227348 0.194714
chargesum: 0.00000
title: Mulliken charges with hydrogens summed into heavy atoms:
elementType: N N C C C C C C C C C C C C C C C C C C C
charge: -0.226742 -0.052205 0.031853 0.346692 0.341707 0.179632 0.193556 -0.119992 -0.030964 0.013901 -0.159635 -0.157475 0.036913 -0.105384 -0.113237 -0.071199 -0.067150 -0.049885 -0.047186 0.030379 0.026421
polarizability: 2.62870989e+02 -1.95595690e+01 2.72512085e+02 -6.21358738e+00 -3.63490079e+00 1.31076911e+02
1716.lowfreq: -11.1312 -5.6651 -0.0003 0.0002 0.0005 3.6348 27.0860 35.6457 54.6210
frequency: 26.7610 35.5886 54.5953 74.3134 91.3117 123.0140 131.9863 141.2873 172.9523 189.1986 221.2374 227.5823 239.0664 268.6214 277.2814 291.7505 306.7141 330.2540 345.8353 362.4238 377.0330 394.9379 409.9403 434.0683 460.7459 477.6456 526.7989 538.6863 543.5858 581.3629 588.8463 609.0854 634.5347 669.1323 684.0474 740.6490 745.4158 754.2266 755.7398 759.6752 775.0315 791.7196 841.1557 858.8094 866.4075 875.0871 894.3082 925.0429 928.5723 940.3159 944.2941 966.0882 977.7115 999.6276 1029.8006 1035.2907 1043.9414 1049.6309 1052.4844 1066.4659 1081.3714 1105.9218 1109.8429 1116.4854 1126.3243 1146.4736 1156.2515 1163.5442 1177.8073 1185.2928 1222.9429 1237.1019 1242.3619 1246.3232 1266.1074 1278.4337 1298.2376 1307.9481 1319.2751 1356.6493 1360.2676 1366.5683 1371.5064 1381.5843 1387.3202 1395.6094 1434.2383 1441.3415 1442.4537 1448.4188 1459.8555 1461.9919 1465.8381 1475.3558 1476.2193 1483.6852 1486.5167 1494.3581 1494.8296 1508.3153 1517.9429 1576.6648 1593.8031 1600.6625 1619.5618 2875.4194 2886.2731 2973.4085 2987.1514 2989.4067 2998.8321 3012.2881 3018.5341 3047.1534 3072.8127 3075.1238 3078.5686 3081.4615 3082.8881 3089.2157 3121.4669 3126.1574 3138.3628 3143.6407 3148.3071 3161.2245 3164.8490 3172.5386 3433.3588
redmass: 3.5806 3.6036 3.7258 3.0986 3.2064 3.2538 3.1819 2.4148 2.8900 3.1517 1.6762 1.2050 2.0942 3.3163 1.2716 2.1309 3.1250 3.1784 4.3665 1.6497 3.3835 2.6221 4.4612 4.7930 3.1841 3.1940 3.6975 3.4761 3.7875 3.6974 3.5103 5.8534 4.9349 4.4492 1.5013 2.3075 1.7186 3.4426 1.8242 2.0226 1.8385 1.8315 1.4749 2.5751 1.4723 2.2479 2.2578 1.7297 1.4516 1.4474 1.5742 1.3082 1.2810 1.3237 1.4196 3.0911 3.4092 2.8525 2.4961 2.6273 2.0859 2.5790 1.4825 1.7226 2.5315 2.6626 1.8512 1.5586 1.0596 1.0954 1.5160 1.8108 1.3669 3.2847 2.8369 1.6138 1.4112 1.7473 1.2832 1.5665 2.0324 1.3426 1.1970 3.8136 7.1263 1.2470 1.1428 2.0721 1.2853 2.6075 1.0834 1.0575 1.0586 1.1335 2.1653 1.0733 1.1389 1.5035 1.0826 1.3511 1.1297 6.3920 7.4433 6.0517 6.3331 1.0687 1.0566 1.0338 1.0773 1.0361 1.0726 1.0638 1.0770 1.0983 1.1008 1.1026 1.0997 1.0980 1.1005 1.1001 1.0853 1.0852 1.0897 1.0898 1.0945 1.0942 1.0985 1.0969 1.0744
irintensity: 0.1251 0.6952 0.9137 0.6834 1.4523 0.7401 0.6674 0.6356 0.0749 0.0702 1.9634 0.0739 0.4618 0.9486 0.0271 5.7807 0.0437 2.6653 3.1950 0.1157 0.2428 0.9040 3.5117 1.8671 2.6470 0.3266 7.1236 11.6317 0.2478 3.3263 0.7906 0.9921 5.5881 22.9181 130.2611 32.9286 30.5585 5.5335 88.8739 15.5931 21.1015 10.1881 1.1976 12.8005 0.3072 6.8462 0.2981 4.3072 1.1447 3.1839 2.2284 0.0058 0.6573 0.0300 1.9326 14.8452 17.8700 15.0959 2.5502 3.7831 7.1105 21.7726 0.2756 6.4064 3.8442 56.3132 7.5333 4.6474 2.0763 0.8849 45.6593 5.6184 10.2937 2.3179 53.5325 19.9824 9.2897 6.4210 1.8655 70.0120 74.5176 7.2753 20.2979 2.7056 2.5533 17.2732 1.4932 15.3719 20.8763 121.2860 9.5178 1.4112 8.3027 12.1442 194.3655 22.0642 32.9710 13.9441 3.6329 34.8774 13.7819 0.0365 8.7611 86.0436 23.3894 59.6227 243.9092 29.8559 7.6417 25.8527 25.5595 48.7340 40.4900 19.1935 9.2133 20.9112 30.8152 51.0777 16.8004 35.5162 11.7542 4.1727 11.1387 15.2934 8.6495 42.9260 37.7792 16.8593 1.0782
temp: 298.150 k
press: 1.00000 atm
elementType: 7 7 6 6 6 6 6 6 6 6 6 6 6 6 6 6 6 6 6 6 6 1 1 1 1 1 1 1 1 1 1 1 1 1 1 1 1 1 1 1 1 1 1 1 1
symmnumber: 1
zpe: 1012206.8 jmol-1
zpe.correction: 0.385529 hartree
zpe.thermalcorrener: 0.405196 hartree
zpe.thermalcorrenthalpy: 0.406140 hartree
zpe.thermalcorrgfe: 0.337774 hartree
zpe.sumelectzpe: -846.373183 hartree
zpe.sumelectthermal: -846.353516 hartree
zpe.sumelectthermalent: -846.352572 hartree
zpe.sumelectthermalfe: -846.420938 hartree
dipole: -2.4482 -0.8429 -0.2058
dipole: 2.5974
quadrupole: -107.0483 -121.2961 -131.5463
quadrupole: 4.4350 1.7060 -1.4807
quadrupole: 12.9153 -1.3325 -11.5828 4.4350 1.7060 -1.4807
hfenergy: -846.7587121 hartree
pointgroup: C01 [X(C19H24N2)]
dipole: -0.9847375 0.2679344 0.052326 debye
polarizability: 259.8262336|18.7258838|275.0409601|10.9035284|-0.703746|131.5927923 unknown
InChI: InChI=1S/C19H24N2/c1-19(2)15-9-4-6-11-17(15)21(14-8-13-20-3)18-12-7-5-10-16(18)19/h4-7,9-12,20H,8,13-14H2,1-3H3
charge 0 multiplicity 1
45 atoms
N  -0.318959 0.407948 -0.310028
N  -4.542593 -0.123781 -0.016584
C  2.372823 -0.600035 -0.207187
C  1.175685 -1.491382 0.174076
C  2.053391 0.854041 0.187701
C  -0.146375 -0.972425 -0.006075
C  0.713852 1.329522 0.013258
C  3.701948 -1.101497 0.404508
C  2.507421 -0.641743 -1.772368
C  -1.672339 0.90697 -0.63238
C  1.322729 -2.840791 0.564252
C  3.048818 1.771571 0.590004
C  -2.559685 1.245486 0.598519
C  -1.267482 -1.840466 0.128375
C  0.440399 2.716847 0.177529
C  0.210535 -3.697119 0.728437
C  2.771835 3.145258 0.774542
C  -1.08416 -3.192444 0.483734
C  1.462113 3.615676 0.543936
C  -4.056352 1.255594 0.223409
C  -5.886748 -0.211053 -0.623167
H  3.671715 -1.096275 1.50896
H  3.926502 -2.127238 0.064557
H  4.547542 -0.474162 0.073083
H  2.70517 -1.675909 -2.109895
H  1.580448 -0.291119 -2.259043
H  3.339007 0.008973 -2.100357
H  -1.568862 1.798572 -1.277238
H  -2.193518 0.141742 -1.23181
H  2.32617 -3.245993 0.725408
H  4.071937 1.416872 0.745984
H  -2.278624 2.225171 1.026909
H  -2.384467 0.496686 1.395581
H  -2.283795 -1.472269 -0.042105
H  -0.57173 3.104427 0.040356
H  0.357053 -4.741528 1.023654
H  3.567719 3.833162 1.078607
H  -1.959761 -3.845301 0.577881
H  1.225437 4.679142 0.663397
H  -4.202569 1.830332 -0.714069
H  -4.641545 1.788285 1.013042
H  -4.477934 -0.684375 0.84492
H  -6.178326 -1.27093 -0.728077
H  -5.861702 0.230518 -1.63651
H  -6.686524 0.31424 -0.046926
