program: Gaussian 09
title: 000145714
version: EM64L-G09RevD.01
frameworkgroup: C1[X(C11H16N2)]
method: RPBEPBE
basis: SDD
operation: Freq
keyword: #pfreq=noraman
keyword: PBEPBE/SDD
title: #p freq=noraman PBEPBE/SDD
converged: YES YES NO NO
title: Mulliken charges:
elementType: N N C C C C C C C C C C C H H H H H H H H H H H H H H H H
charge: -0.143238 -0.063896 -0.395452 -0.423599 -0.270593 0.480782 -0.633193 -0.643244 -0.425850 -0.349952 -0.240325 -0.249057 -0.241122 0.217791 0.232553 0.235815 0.217934 0.195989 0.212304 0.224667 0.214057 0.217784 0.204716 0.258518 0.228082 0.265663 0.223131 0.223178 0.226556
chargesum: 0.00000
title: Mulliken charges with hydrogens summed into heavy atoms:
elementType: N N C C C C C C C C C C C
charge: -0.143238 -0.063896 0.054893 0.030151 -0.074603 0.480782 0.017834 0.037774 -0.197769 -0.084288 -0.017195 -0.025879 -0.014566
polarizability: 1.59379814e+02 -4.22130783e+00 1.11529091e+02 -1.42035041e+00 -1.10971323e+01 1.14413605e+02
1716.lowfreq: -8.6274 -0.0008 -0.0007 -0.0006 6.9242 10.7767 47.4105 65.1634 88.8292
frequency: 47.2563 65.1601 88.7723 99.5544 149.3280 172.6381 227.1765 239.8207 248.7346 293.2199 313.2746 345.5632 369.3123 407.3742 410.5391 480.2872 542.4026 615.7561 634.6949 707.4478 754.6748 761.9152 816.8649 831.3284 848.8550 852.1221 857.6533 925.2845 977.1813 982.0680 987.8104 991.2422 995.1336 1023.2080 1030.7211 1043.0546 1069.9382 1074.1203 1078.6436 1091.1386 1122.8595 1137.8022 1144.0120 1170.2009 1182.2742 1190.0648 1196.3066 1256.2107 1269.9207 1292.1042 1334.5980 1352.0353 1385.8107 1413.3568 1434.9646 1438.9345 1456.0968 1462.4302 1472.8257 1477.8292 1478.3552 1482.1123 1495.1713 1590.3295 1609.6811 2855.7500 2880.2928 2895.4528 3009.2099 3025.9327 3058.8258 3065.6087 3070.0186 3100.1981 3107.7277 3122.5519 3135.7330 3151.8369 3163.0892 3164.8668 3182.7408
redmass: 3.5048 3.5988 2.8255 3.2454 3.1898 2.6281 2.3643 1.0939 1.1972 3.3575 3.3440 3.1884 3.5129 2.8396 2.9164 3.5425 3.3571 6.3670 5.3297 1.7630 2.0274 1.3659 5.5193 2.9002 2.6826 4.5065 1.2548 1.4696 1.3835 1.6452 2.5918 2.2096 1.3151 2.2815 2.0710 1.4828 1.2782 1.3179 1.5471 1.2366 1.9178 1.4498 1.4463 1.0677 1.1677 2.5101 2.7648 2.9200 2.6710 1.5147 1.3540 1.3984 5.3662 1.1402 1.1500 2.1317 1.0526 1.0789 1.1221 1.9001 1.2112 1.0596 1.0546 6.0547 6.0714 1.0817 1.0531 1.0531 1.0764 1.0798 1.0511 1.1004 1.0607 1.0980 1.0872 1.0863 1.0922 1.0954 1.0999 1.1155 1.1158
irintensity: 0.1221 1.9009 1.5869 1.0591 1.1534 0.7412 2.6674 0.5045 1.4753 0.0734 0.3210 20.0867 1.9648 0.7450 5.0151 10.2174 9.3419 0.1439 15.2301 51.8965 36.1750 10.6067 8.3803 13.8273 5.5316 6.5529 0.0572 6.5465 0.8749 14.9450 21.6540 27.5571 0.3636 41.2056 46.6705 6.2547 6.2261 9.5398 11.8308 3.6354 4.5487 0.9942 2.9258 0.6520 3.5003 7.4974 10.6859 36.8133 3.2564 34.3806 21.5247 7.3138 2.1284 13.3867 5.6252 13.0643 14.6590 5.1633 22.0304 7.4528 3.7918 5.8997 14.6698 1.3904 4.5597 58.4756 72.7049 105.9127 52.5797 52.9666 30.3121 36.3502 35.0164 12.3721 10.4734 0.4007 28.6213 29.9415 18.3341 2.9141 38.5373
temp: 298.150 k
press: 1.00000 atm
elementType: 7 7 6 6 6 6 6 6 6 6 6 6 6 1 1 1 1 1 1 1 1 1 1 1 1 1 1 1 1
symmnumber: 1
zpe: 647702.4 jmol-1
zpe.correction: 0.246697 hartree
zpe.thermalcorrener: 0.259635 hartree
zpe.thermalcorrenthalpy: 0.260579 hartree
zpe.thermalcorrgfe: 0.207356 hartree
zpe.sumelectzpe: -537.208005 hartree
zpe.sumelectthermal: -537.195067 hartree
zpe.sumelectthermalent: -537.194123 hartree
zpe.sumelectthermalfe: -537.247346 hartree
dipole: 0.0802 0.1795 -1.1022
dipole: 1.1195
quadrupole: -75.7253 -77.4269 -74.6020
quadrupole: 0.9214 1.3684 -1.9472
quadrupole: 0.1928 -1.5088 1.3161 0.9214 1.3684 -1.9472
hfenergy: -537.4547019 hartree
pointgroup: C01 [X(C11H16N2)]
dipole: -0.0317437 -0.1041304 -0.4268002 debye
polarizability: 158.4211824|-7.6210092|114.2573007|3.4062924|10.8871217|112.6440276 unknown
InChI: InChI=1S/C11H16N2/c1-12(2)11(13-8-9-13)10-6-4-3-5-7-10/h3-7,11H,8-9H2,1-2H3
charge 0 multiplicity 1
29 atoms
N  1.792837 0.869464 0.224638
N  1.407935 -1.504056 0.291948
C  3.165502 1.037174 -0.362936
C  2.061004 2.032927 -0.694564
C  0.980455 -0.23535 -0.358866
C  -0.513179 0.090932 -0.21296
C  0.947508 -2.71796 -0.404927
C  1.207917 -1.562911 1.755011
C  -1.430716 -0.365125 -1.193034
C  -1.010586 0.791797 0.916143
C  -2.817964 -0.134727 -1.049226
C  -2.395656 1.025247 1.061273
C  -3.305374 0.560736 0.081309
H  3.470756 0.33134 -1.146935
H  3.953001 1.303868 0.348438
H  2.044335 3.020687 -0.223585
H  1.637266 1.998325 -1.707878
H  1.195393 -0.382549 -1.448206
H  -0.152752 -2.895808 -0.32945
H  1.462404 -3.596733 0.024784
H  1.212154 -2.658358 -1.477251
H  1.801128 -2.401812 2.1632
H  0.143318 -1.710311 2.055353
H  1.572288 -0.623284 2.199692
H  -1.056613 -0.894408 -2.079414
H  -0.297322 1.165689 1.657923
H  -3.514204 -0.48907 -1.818082
H  -2.76701 1.574091 1.934562
H  -4.379927 0.744583 0.194337
