program: Gaussian 09
title: 000145794
version: EM64L-G09RevD.01
frameworkgroup: C1[X(C20H24N2O2S)]
method: RPBEPBE
basis: SDD
operation: Freq
keyword: #p
keyword: freq=noraman
keyword: PBEPBE/SDD
title: #p freq=noraman PBEPBE/SDD
converged: YES YES NO NO
title: Mulliken charges:
elementType: S O O N N C C C C C C C C C C C C C C C C C C C C H H H H H H H H H H H H H H H H H H H H H H H H
charge: 0.201307 -0.433311 -0.319725 -0.283480 -0.103193 -0.373494 -0.386570 0.306329 0.328514 -0.509543 -0.324334 -0.324432 -0.390919 0.471194 0.057144 -0.427752 0.411492 -0.311743 -0.674090 -0.674990 -0.823846 -0.345092 -0.299747 -0.243775 -0.221004 0.265266 0.221737 0.370308 0.196500 0.255872 0.200195 0.191283 0.211121 0.191160 0.312243 0.243925 0.226057 0.222044 0.203578 0.208493 0.225188 0.205072 0.245746 0.243323 0.237432 0.289838 0.249411 0.239993 0.239279
chargesum: 0.00000
title: Mulliken charges with hydrogens summed into heavy atoms:
elementType: S O O N N C C C C C C C C C C C C C C C C C C C C
charge: 0.201307 -0.433311 -0.319725 0.086828 -0.103193 0.113510 0.065801 0.306329 0.328514 -0.509543 0.067144 0.077848 -0.078677 0.471194 0.057144 -0.183827 0.411492 -0.311743 -0.022412 -0.036238 -0.097345 -0.055254 -0.050337 -0.003782 0.018275
polarizability: 3.99533677e+02 4.05346200e+01 3.32863236e+02 -4.58044355e+01 1.25440418e+01 1.66091559e+02
1716.lowfreq: -6.4782 -0.7164 -0.0023 -0.0019 0.0013 4.2585 8.0982 22.8406 29.6734
frequency: 7.8363 22.6710 29.6371 38.3633 51.9564 65.8382 76.9255 89.1897 109.4024 130.7148 145.5501 159.9621 167.5361 174.8773 189.3037 204.7208 218.9349 228.3557 242.2270 265.9005 275.0511 294.2351 305.5125 311.2176 340.0453 365.8715 397.2332 403.8890 415.4817 430.2072 434.6407 445.5665 465.2334 477.7391 484.9226 501.7383 530.1390 538.6666 594.5846 614.3367 652.4314 674.6334 714.0980 722.4578 735.0138 753.5492 762.4663 788.8021 796.4632 800.1168 808.9213 823.3768 841.9366 855.6451 875.1959 884.8186 893.9415 921.5040 945.8176 975.7195 978.1969 992.1211 1008.0279 1017.5840 1030.4336 1046.8875 1058.0760 1058.9789 1063.6528 1075.5829 1083.9317 1085.2653 1093.0681 1116.3187 1123.7031 1147.1931 1152.1072 1174.9014 1179.2441 1207.8008 1228.6226 1236.1464 1252.1024 1264.5861 1275.2242 1290.9898 1299.7443 1307.0999 1314.3402 1357.0169 1361.1932 1363.3313 1369.9253 1382.0477 1387.8434 1388.7613 1389.7453 1402.8431 1416.4919 1426.4029 1431.0081 1442.1972 1457.2782 1462.0404 1463.2250 1467.7219 1471.1555 1473.4415 1478.9165 1486.8450 1489.4556 1491.3109 1496.9990 1566.0773 1578.4925 1598.9219 1606.2431 2855.1862 2864.0029 2885.1595 2972.8969 2981.9972 2982.3757 3021.4944 3023.2267 3031.7514 3047.0171 3050.5283 3074.2537 3076.1780 3083.5233 3089.9607 3090.2368 3093.3760 3118.1319 3134.8082 3136.0620 3147.7180 3155.6597 3161.5266 3174.7980
redmass: 4.3710 3.4116 4.9169 5.8797 4.1740 3.6977 2.7834 2.1630 3.4801 4.0068 3.0875 1.8557 1.3296 2.9199 2.0581 5.1061 1.4246 3.2909 3.7764 2.1644 5.1268 2.1976 3.7905 3.3304 5.3293 4.3200 7.1022 4.2531 3.8593 7.4179 4.3657 3.1379 2.9536 3.9497 6.0585 3.9576 3.7976 5.6931 4.7488 5.8104 6.1206 4.4881 5.3033 5.5220 3.9335 3.4376 1.5883 1.3164 1.1390 1.4437 3.0902 4.2975 1.7753 3.8767 2.5201 1.4343 6.1327 1.9741 2.4194 1.3734 1.5464 2.2363 1.3446 1.8102 3.1872 1.5387 2.5071 3.0046 2.0613 1.9577 2.5717 2.2207 3.3487 1.7074 1.8256 1.6021 1.4390 1.0769 2.6533 2.2482 1.7426 1.9393 1.6716 1.3986 1.2019 1.2459 1.1571 1.3962 2.6926 4.0840 1.3776 1.3615 3.7941 1.3935 1.2555 1.2448 7.0692 1.2357 2.4882 2.2244 1.2184 1.5415 2.3700 1.0510 1.0536 1.0452 1.0618 1.2747 1.0599 1.0679 1.0735 1.0916 2.7221 6.5545 5.8414 5.8576 6.2006 1.0717 1.0716 1.0715 1.0383 1.0357 1.0356 1.0649 1.0826 1.0876 1.0972 1.0767 1.0985 1.0981 1.0878 1.1003 1.1000 1.0979 1.1043 1.0865 1.0889 1.0904 1.0954 1.0945 1.0996
irintensity: 0.2344 0.2158 0.6279 1.0754 2.5045 0.7595 1.7800 0.1954 6.9232 0.6085 5.8638 3.0295 0.1497 0.5443 1.9259 0.8038 2.1909 5.0379 1.8509 1.6861 7.0731 2.7213 3.5210 3.7989 4.3519 4.2038 5.9760 11.7725 1.4406 0.8138 2.9227 3.1159 10.1705 11.2256 3.8966 1.1051 12.2675 7.9531 31.3764 7.7657 2.4715 7.4996 4.8309 1.7247 14.1290 9.8798 51.4869 9.3967 4.2778 1.7968 14.1601 7.9394 19.0448 6.0419 18.3392 0.3111 28.3144 7.0945 1.3514 1.7130 4.9028 5.3999 0.4992 16.5723 19.0595 6.2951 4.5507 11.9140 25.7724 21.5254 48.7154 4.3222 2.5068 23.6887 1.2370 27.6312 41.1377 5.3313 5.2767 52.0175 11.8280 49.5833 2.2585 55.3418 14.3044 31.3748 23.9392 9.5326 116.7809 1.0685 12.0567 3.7234 21.7080 5.7294 25.6310 22.2359 15.2231 22.8587 26.7339 95.5627 37.1665 69.1238 3.2800 4.5373 4.6495 17.1078 2.7781 58.5450 1.3162 9.9349 19.5677 19.2085 42.0249 7.5597 41.1986 70.6935 9.2970 34.9454 160.2849 102.7995 23.6873 37.2992 33.1420 13.7992 12.5707 27.3428 12.0974 39.9132 23.5094 91.8016 3.3818 40.6848 46.8002 17.6705 6.4817 0.5905 14.2963 7.9079 8.6227 8.6677 25.4236
temp: 298.150 k
press: 1.00000 atm
elementType: 16 8 8 7 7 6 6 6 6 6 6 6 6 6 6 6 6 6 6 6 6 6 6 6 6 1 1 1 1 1 1 1 1 1 1 1 1 1 1 1 1 1 1 1 1 1 1 1 1
symmnumber: 1
zpe: 1044303.2 jmol-1
zpe.correction: 0.397754 hartree
zpe.thermalcorrener: 0.422567 hartree
zpe.thermalcorrenthalpy: 0.423511 hartree
zpe.thermalcorrgfe: 0.340554 hartree
zpe.sumelectzpe: -1432.618801 hartree
zpe.sumelectthermal: -1432.593988 hartree
zpe.sumelectthermalent: -1432.593044 hartree
zpe.sumelectthermalfe: -1432.676001 hartree
dipole: -4.4447 -2.0458 3.5062
dipole: 6.0195
quadrupole: -136.4595 -139.8880 -168.3424
quadrupole: -3.8914 1.0747 10.1571
quadrupole: 11.7705 8.3419 -20.1124 -3.8914 1.0747 10.1571
hfenergy: -1433.0165552 hartree
pointgroup: C01 [X(C20H24N2O2S1)]
dipole: -1.5831896 0.5014307 1.6883897 debye
polarizability: 387.1971951|-19.8513539|281.2587536|-83.5222321|-67.5470689|230.0325231 unknown
InChI: InChI=1S/C20H24N2O2S/c1-4-21(5-2)12-13-22(24)16-11-10-14(3)20-18(16)19(23)15-8-6-7-9-17(15)25-20/h6-11,22H,4-5,12-13H2,1-3H3
charge 0 multiplicity 1
49 atoms
S  -3.40473 1.641226 0.275094
O  2.036112 0.047084 -2.912656
O  -0.147777 -1.531196 -0.121021
N  1.422089 -0.067436 -1.629289
N  4.565963 -0.873378 0.3937
C  2.47342 0.087894 -0.511432
C  3.548989 -0.998479 -0.676051
C  0.329585 0.958195 -1.436399
C  -0.852913 0.707135 -0.65858
C  -1.818795 1.768552 -0.613586
C  5.94949 -1.161221 -0.069456
C  4.192358 -1.599652 1.63718
C  0.526805 2.157288 -2.126049
C  -1.617056 3.015682 -1.271508
C  -1.049966 -0.611616 -0.006737
C  -0.428972 3.186346 -2.017967
C  -2.276379 -0.926606 0.770054
C  -3.358719 -0.028477 0.968599
C  6.535807 -0.030944 -0.936403
C  4.823105 -0.992173 2.905094
C  -2.644464 4.128824 -1.198629
C  -2.362332 -2.221742 1.364216
C  -4.491025 -0.408757 1.733717
C  -3.47804 -2.604583 2.121231
C  -4.549731 -1.690987 2.307332
H  2.915059 1.088465 -0.637116
H  1.964279 0.014657 0.466459
H  0.970195 -1.004308 -1.456561
H  3.067551 -2.007306 -0.682058
H  4.005207 -0.854204 -1.668833
H  6.584935 -1.2840 0.826721
H  5.997752 -2.129808 -0.628344
H  3.091242 -1.556069 1.735075
H  4.455952 -2.685709 1.566333
H  1.41555 2.214327 -2.763156
H  -0.261177 4.139575 -2.531673
H  5.93697 0.137317 -1.84946
H  6.558362 0.913607 -0.365118
H  7.566393 -0.280594 -1.251762
H  5.927291 -1.024426 2.872274
H  4.518433 0.063554 3.01222
H  4.498881 -1.549774 3.803925
H  -3.615956 3.816864 -1.628242
H  -2.838419 4.439375 -0.154095
H  -2.298205 5.014047 -1.756506
H  -1.51882 -2.898822 1.199658
H  -5.316974 0.296989 1.874061
H  -3.523948 -3.60295 2.567621
H  -5.426076 -1.980086 2.897224
