program: Gaussian 09
title: 000145713
version: EM64L-G09RevD.01
frameworkgroup: C1[X(C15H20N2O3)]
method: RPBEPBE
basis: SDD
operation: Freq
keyword: #p
keyword: freq=noraman
keyword: PBEPBE/SDD
title: #p freq=noraman PBEPBE/SDD
converged: NO YES NO NO
title: Mulliken charges:
elementType: O O O N N C C C C C C C C C C C C C C C H H H H H H H H H H H H H H H H H H H H
charge: -0.264271 -0.284668 -0.221883 -0.111961 -0.399221 -0.365737 -0.596810 -0.476952 0.509045 0.250526 0.142334 -0.399878 -0.378618 -0.381317 0.347556 -0.293897 -0.342770 -0.386420 -0.351826 -0.685869 0.246723 0.232617 0.268735 0.227766 0.249876 0.253374 0.355053 0.228590 0.266930 0.211058 0.210625 0.203810 0.204290 0.194102 0.194359 0.250748 0.250269 0.212433 0.212605 0.218675
chargesum: 0.00000
title: Mulliken charges with hydrogens summed into heavy atoms:
elementType: O O O N N C C C C C C C C C C C C C C C
charge: -0.264271 -0.284668 -0.221883 -0.111961 -0.044168 0.113603 -0.100309 0.026298 0.509045 0.250526 0.142334 -0.171288 -0.111688 0.040366 0.347556 0.114203 0.045691 -0.135672 -0.101557 -0.042157
polarizability: 2.49539989e+02 1.19884018e+00 1.58190170e+02 9.75200779e-01 -1.57743728e+01 1.55624173e+02
1716.lowfreq: -10.7703 -5.7615 -0.6922 -0.0003 0.0004 0.0007 13.7223 22.3986 33.2566
frequency: 12.1877 22.0462 33.1396 37.0771 58.6600 66.1606 80.7644 103.0501 141.4154 151.7181 162.7452 168.7460 197.4881 219.4196 230.9774 272.7877 288.6369 324.3636 364.3417 382.8706 400.2026 414.7749 444.6088 467.8015 489.6395 521.4404 533.3246 579.5547 589.9679 632.5006 675.3736 686.6085 712.5135 742.6960 748.0322 761.8009 769.8267 806.6426 811.0734 822.9690 831.3305 848.2676 903.0855 915.1785 939.5409 945.7316 957.6660 967.4201 971.1295 1003.5498 1011.0653 1041.0155 1052.4543 1083.8574 1099.2492 1122.8698 1125.9410 1145.8601 1152.8503 1179.0586 1197.7693 1211.6712 1213.6238 1226.6332 1231.0971 1263.7187 1273.3752 1280.6199 1286.1765 1298.0627 1311.5348 1320.7816 1345.7627 1346.3770 1355.2455 1367.4143 1373.0383 1386.6628 1390.8617 1418.9646 1424.6255 1442.8272 1458.9826 1468.6596 1472.2756 1477.3240 1480.8957 1489.6940 1489.8051 1502.2307 1583.1400 1621.4690 1636.0207 1652.0421 2945.6861 2967.4953 2970.7898 2976.2027 2994.6204 3003.2794 3003.9259 3005.2092 3011.8841 3057.5149 3059.3745 3075.1627 3076.8025 3077.3319 3095.8122 3116.0750 3134.6309 3163.2478 3166.6692 3525.2048
redmass: 4.3227 3.3387 3.5436 5.2991 2.3159 4.0602 4.3840 3.4618 2.1322 3.6614 4.3151 6.6663 3.2741 4.6946 1.1164 3.3636 4.9861 6.0958 2.5956 7.1145 2.5049 2.9891 3.3871 4.5119 4.2275 3.4165 4.0368 3.2350 4.1465 6.6133 2.9351 4.6633 3.9337 1.0756 3.1742 1.9729 3.8314 2.0079 1.3391 3.9604 1.2257 1.8979 1.7989 2.1654 1.1609 1.9910 1.4699 6.3161 1.3595 2.7648 1.9000 3.4560 2.0777 2.1770 2.4814 2.2476 1.7140 1.4501 1.8917 1.3259 1.4700 2.2481 1.3735 2.5938 2.6181 1.7849 1.3069 1.1756 1.0660 1.7908 1.4329 1.3679 1.5653 1.8001 1.4110 1.7796 1.9069 1.9478 1.4423 3.1348 2.3426 1.1003 1.1032 1.0799 1.0760 1.0424 1.1007 1.1370 1.1337 2.1661 6.9981 6.3419 9.5206 5.3263 1.0550 1.0588 1.0679 1.0362 1.0592 1.1054 1.0634 1.0651 1.1016 1.0959 1.1043 1.1015 1.0995 1.0998 1.0966 1.0895 1.0899 1.0941 1.0945 1.0767
irintensity: 0.1267 2.5716 2.0984 1.3639 0.0307 1.4297 1.1907 0.6180 1.1372 2.0938 0.7909 7.8945 1.7324 2.6601 0.0799 3.7337 6.1449 6.5471 0.0720 16.4882 1.4096 0.2261 17.3372 2.1699 4.1798 12.1446 26.7008 7.7989 32.0447 1.7720 11.6486 2.5144 0.2895 10.7861 44.9602 73.1851 15.7896 29.3286 6.1213 4.2085 0.4184 51.3861 19.9039 1.3063 0.3064 0.6851 1.0316 65.8286 1.2698 5.7969 7.4748 22.6084 9.0586 8.4798 9.5031 2.1136 22.6891 1.8589 18.6962 163.3411 93.3288 13.0893 0.1975 296.2726 67.4108 182.4242 4.4408 0.4949 0.0570 31.4302 15.0214 10.4809 19.0464 57.7942 17.3870 9.3540 18.9804 19.6144 10.7489 76.4551 101.6425 17.9825 35.8835 5.2242 2.7811 13.0132 38.7170 62.4120 16.1732 95.6536 7.4338 92.3748 254.0318 445.2664 27.7078 34.6838 36.3250 34.9472 37.8665 25.3312 38.8996 12.0918 3.4533 18.9803 17.6147 102.7865 49.0170 2.7985 8.3030 19.4149 3.8699 10.8244 8.4442 49.8630
temp: 298.150 k
press: 1.00000 atm
elementType: 8 8 8 7 7 6 6 6 6 6 6 6 6 6 6 6 6 6 6 6 1 1 1 1 1 1 1 1 1 1 1 1 1 1 1 1 1 1 1 1
symmnumber: 1
zpe: 867013.7 jmol-1
zpe.correction: 0.330228 hartree
zpe.thermalcorrener: 0.350044 hartree
zpe.thermalcorrenthalpy: 0.350989 hartree
zpe.thermalcorrgfe: 0.278040 hartree
zpe.sumelectzpe: -917.298377 hartree
zpe.sumelectthermal: -917.278560 hartree
zpe.sumelectthermalent: -917.277616 hartree
zpe.sumelectthermalfe: -917.350565 hartree
dipole: 3.4864 1.9886 -1.5465
dipole: 4.3013
quadrupole: -125.3305 -119.6313 -125.2498
quadrupole: -23.5359 6.0613 -7.2342
quadrupole: -1.9266 3.7726 -1.8459 -23.5359 6.0613 -7.2342
hfenergy: -917.6286047 hartree
pointgroup: C01 [X(C15H20N2O3)]
dipole: 1.3831333 0.4753901 -0.8512899 debye
polarizability: 249.3447596|-4.4463018|148.7088765|-1.9180966|-13.3660184|165.3006963 unknown
InChI: InChI=1S/C15H20N2O3/c1-2-3-10-20-13-6-4-12(5-7-13)11-17-9-8-14(18)16-15(17)19/h4-7,16H,2-3,8-11H2,1H3
charge 0 multiplicity 1
40 atoms
O  3.429155 0.265126 -0.772581
O  -3.092643 0.340826 2.431604
O  -5.782092 -2.257814 -0.333036
N  -2.992858 0.777499 0.121693
N  -4.318372 -1.002008 0.967287
C  -3.200909 0.228014 -1.236511
C  -2.004687 1.873104 0.306281
C  -4.621765 -0.346074 -1.37866
C  -0.565122 1.44327 0.04558
C  -3.426499 0.081841 1.237506
C  -4.967638 -1.302014 -0.239804
C  0.119229 1.844025 -1.131324
C  0.118494 0.62299 0.976721
C  5.56935 -0.808527 -0.432768
C  2.114007 0.614122 -0.438245
C  4.179941 -0.589826 0.168648
C  6.462468 -1.689687 0.471825
C  1.44475 1.438629 -1.376817
C  1.446657 0.204064 0.745709
C  7.866532 -1.912937 -0.129813
H  -2.443318 -0.552072 -1.456443
H  -3.048922 1.045762 -1.962439
H  -2.125506 2.221722 1.346159
H  -2.288856 2.697917 -0.374023
H  -4.736036 -0.891524 -2.329475
H  -5.369676 0.470514 -1.369729
H  -4.572032 -1.558299 1.790049
H  -0.38691 2.488234 -1.861806
H  -0.396359 0.313932 1.894146
H  6.049769 0.175773 -0.592974
H  5.461036 -1.278874 -1.428914
H  3.645458 -1.554238 0.300253
H  4.248557 -0.084736 1.1550
H  5.971033 -2.670414 0.636004
H  6.55967 -1.216626 1.470293
H  1.980895 1.747976 -2.279223
H  1.94705 -0.425346 1.48719
H  7.800928 -2.412515 -1.114432
H  8.39217 -0.950828 -0.276184
H  8.491251 -2.543382 0.528654
