program: Gaussian 09
title: 000145712
version: EM64L-G09RevD.01
frameworkgroup: C1[X(C12H7FO)]
method: RPBEPBE
basis: SDD
operation: Freq
keyword: #p
keyword: freq=noraman
keyword: PBEPBE/SDD
title: #p freq=noraman PBEPBE/SDD
converged: NO YES NO YES
title: Mulliken charges:
elementType: F O C C C C C C C C C C C C H H H H H H H
charge: -0.195277 -0.180127 -0.079479 0.361236 -0.644487 0.234373 0.304635 -0.023875 -0.395523 -0.387158 0.164776 -0.387303 -0.378255 -0.200830 0.263167 0.263288 0.253049 0.273570 0.265548 0.253490 0.235181
chargesum: 0.00000
title: Mulliken charges with hydrogens summed into heavy atoms:
elementType: F O C C C C C C C C C C C C
charge: -0.195277 -0.180127 -0.079479 0.361236 -0.118032 0.234373 0.304635 -0.023875 -0.142474 -0.113588 0.164776 -0.121755 -0.124765 0.034351
polarizability: 1.72340602e+02 -4.97585932e+00 1.65973347e+02 -1.70963382e-04 2.22638552e-03 5.36395775e+01
1716.lowfreq: -5.7192 -3.9876 0.0002 0.0005 0.0007 8.4475 88.4928 146.3629 180.3299
frequency: 88.4880 146.3621 180.3291 194.6482 249.9485 280.3134 338.2950 400.4282 424.0273 458.1493 490.6307 528.5383 530.8297 551.8076 577.4478 604.2270 624.1258 663.2416 740.6257 770.8096 784.7632 827.1411 832.8613 850.5312 919.1090 941.7158 963.3061 989.9270 999.1006 1017.0025 1048.3141 1124.6094 1128.0506 1139.8384 1180.5097 1197.4207 1226.2159 1244.9371 1261.0511 1360.7424 1389.3435 1410.1218 1417.4382 1464.4827 1466.5248 1503.6380 1600.4797 1604.4780 1628.2734 1643.3777 3003.1416 3053.9216 3139.9397 3147.4953 3157.9882 3170.4289 3173.1557
redmass: 9.2005 3.7381 3.7822 3.8975 11.0654 7.5128 3.8364 11.1962 4.1361 3.2349 6.4507 6.6723 3.0031 5.4906 6.8730 3.2441 5.3563 3.8627 5.3215 2.0690 5.0704 1.8512 1.5030 6.7437 1.6863 1.3787 1.8947 5.9424 1.3720 3.2959 1.9665 1.1804 3.2681 2.3507 1.2913 1.3300 1.8414 2.4049 2.3690 2.8047 3.4650 2.9735 1.1465 4.3191 4.4273 5.0315 8.8186 7.0275 9.8946 10.2981 1.0609 1.0998 1.0870 1.0902 1.0926 1.0984 1.0949
irintensity: 5.9481 0.1091 9.7444 0.7177 3.3086 2.9649 3.5599 0.1472 3.4763 0.1355 0.9121 12.3440 0.0396 4.2706 0.5865 0.0739 16.1598 0.4714 0.8893 22.6202 3.2879 70.7349 30.0099 9.8596 4.3262 0.4090 3.4439 31.0455 0.5597 13.6111 25.2423 0.0573 15.1339 48.2572 17.0870 13.4930 26.7930 30.2575 0.3304 22.7788 28.1989 9.0523 24.9565 8.9823 70.8624 7.1876 99.9299 0.0040 121.1668 111.8247 8.4166 3.3368 4.6321 8.6802 1.5759 17.5019 3.8131
temp: 298.150 k
press: 1.00000 atm
elementType: 9 8 6 6 6 6 6 6 6 6 6 6 6 6 1 1 1 1 1 1 1
symmnumber: 1
zpe: 399879.6 jmol-1
zpe.correction: 0.152306 hartree
zpe.thermalcorrener: 0.162251 hartree
zpe.thermalcorrenthalpy: 0.163196 hartree
zpe.thermalcorrgfe: 0.116897 hartree
zpe.sumelectzpe: -635.613711 hartree
zpe.sumelectthermal: -635.603766 hartree
zpe.sumelectthermalent: -635.602821 hartree
zpe.sumelectthermalfe: -635.649120 hartree
dipole: 1.8061 -0.6560 -0.0002
dipole: 1.9215
quadrupole: -97.5900 -62.4723 -81.2279
quadrupole: -1.8848 0.0029 -0.0007
quadrupole: -17.1599 17.9578 -0.7978 -1.8848 0.0029 -0.0007
hfenergy: -635.7660169 hartree
pointgroup: C01 [X(C12H7F1O1)]
dipole: -0.7212925 -0.2263671 0.0000691 debye
dipolederiv: -1.0230339 0.2548648 -0.000013 0.387656 -0.3271186 0.000003 -0.0001391 0.0000581 -0.1371903 -1.3094134 0.0999537 -0.0004234 -0.0219882 -0.4244081 -0.0000518 0.0007189 0.0000005 -0.3193689 -0.054334 -0.097916 0.0000294 0.273815 -0.004782 0.0000708 -0.0000835 0.0002139 -0.0256026 0.166964 -0.1511688 -0.000066 -0.1911629 -0.0446617 -0.0000303 -0.0001108 -0.000028 -0.0395374 -0.0752912 -0.127712 0.0000754 -0.1327216 -0.3173489 -0.0002295 0.0000438 -0.0005799 0.1265695 -0.4496301 0.2385001 0.0000317 0.4748902 -0.4237473 0.0000126 -0.0000848 0.0000868 0.0300925 -0.1538822 0.2437547 -0.0000253 0.0084281 -0.0816875 -0.0000064 -0.0000118 -0.0000206 0.0644926 1.5481104 -0.1441878 0.0003557 -0.3133489 0.9364812 0.0001177 -0.0003054 0.0001388 0.1281451 0.0041375 0.0145677 0.0000413 -0.0830267 0.1514043 0.0000754 -0.0000086 0.0000718 -0.1679195 0.1938771 0.0572214 0.000027 -0.1658928 0.0530141 -0.0000555 -0.0000667 0.0000422 -0.1195 1.1661424 -0.2606875 0.0000504 -0.4232779 0.339108 -0.0000148 0.0001833 -0.000121 0.049706 0.1325195 -0.1003873 0.0000125 0.1191574 0.060053 -0.000008 0.0000002 -0.0000375 -0.1310896 -0.0457985 -0.0286731 -0.0000022 0.1840517 -0.1833352 0.0000359 0.0000052 0.0000174 -0.1516323 -0.3015818 0.0109491 -0.0000345 -0.0628084 0.1552633 -0.0000593 -0.0000175 -0.000058 -0.1521967 0.0260133 0.0176968 -0.032913 0.0122753 0.070527 0.067832 -0.0642018 0.0962679 0.0141176 0.0259581 0.0175774 0.032874 0.0120951 0.0707559 -0.0676798 0.0641023 -0.0960699 0.0141034 0.0872775 0.0125315 0.0000044 -0.0021801 -0.089015 -0.0000343 0.0000108 -0.0000236 0.1582505 -0.0057893 -0.075431 -0.0000072 -0.0473294 0.0636237 0.0000045 -0.000034 -0.000008 0.1593888 0.0107555 0.0822984 -0.0000114 0.0408219 0.0448896 0.0000106 -0.0000242 0.0000509 0.1601128 -0.0264267 -0.0589042 -0.0000106 -0.0697421 0.0721766 -0.0000201 -0.0000247 -0.0000269 0.1802743 0.0834259 -0.0048478 0.0000048 0.0002881 -0.1211924 0.0000272 0.0000484 0.000025 0.1587844 unknown
polarizability: 172.7683784|4.6746573|165.5455704|-0.0002694|-0.0022166|53.6395775 unknown
InChI: InChI=1S/C12H7FO/c13-10-5-4-7-6-11(14)9-3-1-2-8(10)12(7)9/h1-5H,6H2
charge 0 multiplicity 1
21 atoms
F  -3.540253 0.475189 -0.000064
O  3.680539 -0.380869 -0.000243
C  0.113592 -0.088905 0.000211
C  0.205305 -1.514611 0.000095
C  1.678469 -1.896972 -0.00011
C  1.387803 0.54932 0.000283
C  -1.11057 0.644377 0.000098
C  2.43091 -0.525034 0.000843
C  -0.978268 -2.253709 -0.000071
C  1.469995 1.946839 0.00002
C  -2.286878 -0.168578 0.000098
C  -1.014695 2.07393 -0.000039
C  -2.240161 -1.561522 0.000008
C  0.248256 2.696496 -0.000113
H  1.983161 -2.484231 0.886645
H  1.983179 -2.483311 -0.887475
H  -0.974272 -3.348434 -0.000247
H  2.4403 2.453844 0.000056
H  -1.92798 2.677435 -0.000157
H  -3.179631 -2.122853 -0.00011
H  0.298298 3.7908 -0.00023
