program: Gaussian 09
title: 000145709
version: EM64L-G09RevD.01
frameworkgroup: C1[X(C10H11ClN2)]
method: RPBEPBE
basis: SDD
operation: Freq
keyword: #p
keyword: freq=noraman
keyword: PBEPBE/SDD
title: #p freq=noraman PBEPBE/SDD
converged: NO YES NO NO
title: Mulliken charges:
elementType: Cl N N C C C C C C C C C C H H H H H H H H H H H
charge: -0.075817 -0.397908 -0.574894 0.386866 0.145405 -0.529557 0.347683 -0.423943 -0.392310 -0.420129 -0.249189 -0.240450 -0.262340 0.231939 0.199434 0.271490 0.316970 0.219656 0.201635 0.234394 0.224311 0.246886 0.278156 0.261711
chargesum: 0.00000
title: Mulliken charges with hydrogens summed into heavy atoms:
elementType: Cl N N C C C C C C C C C C
charge: -0.075817 -0.080938 -0.035027 0.386866 0.145405 -0.098184 0.347683 -0.152452 0.028981 -0.185735 -0.249189 -0.016139 -0.015454
polarizability: 1.76395750e+02 -3.66077989e+00 1.45153489e+02 -8.65925696e+00 -1.95268544e+00 6.73458618e+01
1716.lowfreq: -11.2712 -9.8677 -0.0022 0.0009 0.0016 1.6086 45.9280 60.5119 77.2697
frequency: 45.9042 60.4993 77.2365 144.9016 164.3417 202.6751 209.8197 239.4292 255.3659 335.1441 365.7966 390.6241 493.7954 498.2558 541.7478 559.6264 570.2156 579.7525 604.9232 636.8460 729.5942 747.8539 780.6871 785.6732 807.3193 824.8280 873.9966 878.9519 938.5142 954.8304 1014.4980 1047.0842 1074.2944 1097.5198 1097.8056 1119.7255 1156.6812 1202.0169 1219.0095 1250.0319 1283.4386 1296.8198 1310.9231 1341.1368 1376.2463 1387.9207 1394.8863 1449.5121 1466.3116 1482.1508 1491.4897 1558.3035 1571.3893 1638.0405 1639.7992 2887.1383 2965.2632 3028.6489 3055.2811 3133.8724 3153.7976 3173.5995 3224.2365 3463.5724 3591.6770 3608.6169
redmass: 3.5676 5.5379 1.9972 5.0846 6.2603 2.8805 1.3412 3.9033 3.4849 3.3450 6.8876 6.6766 3.8288 4.3850 1.4080 3.4960 2.4136 1.4984 4.8726 3.7492 2.7615 2.3067 2.0531 1.2997 1.5992 4.5992 5.4166 1.4158 1.8064 1.3193 2.1753 2.0224 2.9779 3.2238 1.7033 1.4202 1.3509 1.6296 1.4549 1.8218 1.2152 1.6634 1.5382 1.9672 1.3844 7.1010 2.1659 5.2225 1.0927 3.6168 1.0872 6.6953 6.3085 1.1038 7.8111 1.0711 1.0660 1.0869 1.0977 1.0864 1.0936 1.0970 1.0985 1.0449 1.0978 1.0810
irintensity: 1.2219 0.2390 4.2137 1.5644 4.6492 2.3375 52.3789 4.5072 1.4026 17.1724 9.9368 2.5868 1.4527 3.9487 84.9857 77.3533 35.7695 190.2383 1.9513 1.5388 27.2582 19.7180 33.9260 15.4409 23.3142 17.3281 30.9562 0.8772 2.0078 0.8643 0.3054 16.2703 26.6784 40.5453 18.5504 2.4704 5.8573 22.3112 1.3770 5.7896 6.4359 0.1894 0.6774 53.1869 15.9605 49.0914 5.6350 12.1630 6.9689 13.8241 5.0847 17.7705 11.3542 41.1584 1.5722 103.1078 36.7175 22.2255 36.2652 5.1421 18.6520 8.3937 0.8422 0.5658 0.4901 76.7572
temp: 298.150 k
press: 1.00000 atm
elementType: 17 7 7 6 6 6 6 6 6 6 6 6 6 1 1 1 1 1 1 1 1 1 1 1
symmnumber: 1
zpe: 499751.3 jmol-1
zpe.correction: 0.190345 hartree
zpe.thermalcorrener: 0.202541 hartree
zpe.thermalcorrenthalpy: 0.203485 hartree
zpe.thermalcorrgfe: 0.151138 hartree
zpe.sumelectzpe: -956.287543 hartree
zpe.sumelectthermal: -956.275348 hartree
zpe.sumelectthermalent: -956.274404 hartree
zpe.sumelectthermalfe: -956.326750 hartree
dipole: 1.5659 -0.0283 0.4144
dipole: 1.6200
quadrupole: -84.6945 -70.5170 -86.6027
quadrupole: 6.4271 2.5729 -0.7173
quadrupole: -4.0898 10.0877 -5.9980 6.4271 2.5729 -0.7173
hfenergy: -956.4778886 hartree
pointgroup: C01 [X(C10H11Cl1N2)]
dipole: -0.6161239 0.0518596 -0.1546981 debye
dipolederiv: -0.634674 0.2546445 0.0798016 0.3822729 -0.3682716 -0.0551673 0.0884978 -0.0400483 -0.0835843 -0.5800498 0.2980551 0.0057256 -0.1019038 -0.5429198 0.0127816 0.0562887 -0.0575539 -0.2570019 -0.9436894 -0.0375029 0.0919808 -0.0657914 -0.484588 0.1796972 0.0942944 0.1758021 -0.3061317 0.1987949 -0.1048641 -0.0251106 0.0416768 -0.1933706 0.0032608 -0.071325 0.029234 -0.1384998 0.1496513 0.3816183 -0.015312 -0.0474058 -0.010558 0.0151998 -0.0148971 -0.0557742 0.0023978 0.0576683 0.0572686 -0.0330204 0.0284601 0.0994237 0.0665233 -0.1674114 0.0688388 0.0890574 -0.4747692 -0.0042561 0.0678467 0.4737524 0.3497198 -0.0513556 0.0777171 -0.002548 0.0335472 0.34971 -0.3767448 -0.0735227 -0.2145313 0.0821791 0.0251244 -0.0853908 0.0645008 -0.1618833 0.7229148 -0.0113798 -0.0515195 -0.1147641 0.3175829 -0.0354619 0.075802 -0.0498755 0.1751693 0.0381143 -0.0341923 -0.0263402 0.0277445 0.0298002 -0.010875 -0.0332299 0.0045223 -0.1609547 0.9499663 -0.3705324 -0.1496351 -0.4638391 0.4903933 0.0691424 -0.1576306 0.0580321 -0.0501468 -0.027815 -0.0632094 -0.0231781 -0.0050252 0.0757801 0.0019127 -0.0286634 0.0083597 -0.1811372 -0.2022775 0.0589974 0.0025933 -0.0025885 -0.2005039 -0.0004457 0.0104142 -0.0091159 -0.1411089 -0.0205287 -0.0587071 0.0486716 -0.096252 -0.0562213 0.0832169 0.0263818 0.0507947 0.0444436 0.0136604 0.0067113 0.0045642 0.0872776 -0.0485159 -0.145121 0.0302224 -0.0905839 -0.0498531 0.0625643 -0.0554583 0.0252396 -0.059655 0.0032908 0.0088463 0.0233035 0.0082921 0.1922568 0.1703636 0.0003109 0.0249515 -0.0248641 0.2609232 0.0006614 0.0266213 0.004953 0.3376084 0.0257632 0.016256 -0.0046518 -0.0119857 -0.0383485 -0.1339369 0.0257975 -0.0958943 -0.0549331 -0.1937388 -0.0899183 0.089875 -0.1521093 -0.0916737 0.1041456 0.0800682 0.054639 -0.0093606 -0.0359825 0.1118849 0.0289632 0.0934674 0.0258475 -0.0081379 0.035025 -0.0130217 0.146258 0.0620304 -0.020523 0.0145676 -0.0275601 -0.1311253 0.000412 0.016514 0.0011261 0.1620165 -0.037216 -0.0558026 0.0312095 -0.0512206 0.0856103 0.0074816 0.0333118 0.0092774 0.1680114 0.1556127 0.0925877 -0.0523832 0.2241537 0.2449651 0.0388086 -0.1223012 0.002897 0.0564943 0.1939264 0.0047564 -0.0613165 0.0806906 0.1005809 -0.1767134 -0.0194103 -0.1268535 0.1873345 unknown
polarizability: 176.4940751|-0.3234932|144.8386054|-10.2782189|-0.3881399|67.5624194 unknown
InChI: InChI=1S/C10H11ClN2/c11-9-3-1-2-8-7(4-5-12)6-13-10(8)9/h1-3,6,13H,4-5,12H2
charge 0 multiplicity 1
24 atoms
Cl 3.865116 -1.175556 -0.388319
N  0.734088 -1.926267 0.099171
N  -4.642698 0.700068 -0.435303
C  -1.140656 -0.637614 0.393351
C  0.006067 0.241441 0.212545
C  -2.576506 -0.220619 0.593264
C  1.160482 -0.603524 0.031878
C  -0.652914 -1.943282 0.320093
C  -3.240213 0.329216 -0.699143
C  0.17595 1.65241 0.194388
C  2.437959 -0.04851 -0.164265
C  1.464232 2.185377 -0.001579
C  2.603223 1.342268 -0.183875
H  -3.188031 -1.069833 0.947739
H  -2.637473 0.561659 1.37882
H  -1.192758 -2.884043 0.412335
H  1.34491 -2.736238 0.015323
H  -3.230658 -0.467048 -1.466262
H  -2.612601 1.162538 -1.097736
H  -0.682064 2.318981 0.333154
H  1.611463 3.2705 -0.016981
H  3.595845 1.775752 -0.336112
H  -5.217435 0.83742 -1.270995
H  -4.758231 1.460106 0.242107
