program: Gaussian 09
title: 000145708
version: EM64L-G09RevD.01
frameworkgroup: C1[X(C12H9F)]
method: RPBEPBE
basis: SDD
operation: Freq
keyword: #pfreq=noraman
keyword: PBEPBE/SDD
title: #p freq=noraman PBEPBE/SDD
converged: NO NO NO NO
title: Mulliken charges:
elementType: F C C C C C C C C C C C C H H H H H H H H H
charge: -0.201583 -0.145955 -0.527371 -0.547793 0.139426 0.327245 0.511915 0.160794 -0.428983 -0.411408 -0.442291 -0.375154 -0.217529 0.246391 0.246389 0.237058 0.237047 0.241787 0.241340 0.240319 0.247291 0.221067
chargesum: 0.00000
title: Mulliken charges with hydrogens summed into heavy atoms:
elementType: F C C C C C C C C C C C C
charge: -0.201583 -0.145955 -0.034592 -0.073688 0.139426 0.327245 0.511915 0.160794 -0.187196 -0.170068 -0.201973 -0.127864 0.003538
polarizability: 1.71834169e+02 3.55457112e+00 1.47102026e+02 4.37908417e-03 1.51449474e-03 5.72950465e+01
1716.lowfreq: -0.0009 -0.0004 0.0005 9.6874 10.7669 12.1880 88.4198 113.5380 206.9619
frequency: 88.3668 113.5249 206.9607 213.6072 254.6733 318.9664 396.9184 443.5011 456.6459 506.9941 521.5564 535.0726 550.4369 606.9183 637.2713 644.4292 705.9656 753.6163 771.8094 816.6545 816.7583 847.0097 905.1151 933.5051 950.7564 952.9600 979.7041 1000.4554 1009.9010 1039.5446 1100.5076 1144.8867 1161.0257 1179.3019 1201.4996 1202.6138 1222.2478 1239.8397 1253.3247 1289.2487 1356.0779 1394.4388 1416.0528 1445.5330 1460.5621 1469.3570 1475.1101 1506.4332 1601.8315 1618.6104 1633.5522 2994.3733 3008.1256 3037.3890 3059.8757 3120.8198 3134.3265 3137.6123 3153.4421 3167.5595
redmass: 1.8212 6.1332 3.4512 3.1986 8.1440 5.1076 5.9901 3.4907 5.5229 6.3722 3.5565 4.8478 2.6955 6.2910 6.0265 3.6332 6.8096 1.8818 1.2406 1.5707 4.3664 2.1693 1.3923 5.7802 3.6545 1.3518 1.3648 4.3729 1.9328 2.0974 2.4999 1.1713 1.5487 1.2626 2.2885 1.0996 1.3130 2.0019 2.1389 1.7221 3.3799 4.1970 1.9733 1.2309 2.5824 1.4777 3.1468 4.5411 6.8604 8.3446 8.9922 1.0595 1.0617 1.1028 1.1024 1.0857 1.0922 1.0886 1.0986 1.0958
irintensity: 0.0084 0.0359 9.8298 4.3057 2.0939 1.5578 2.6802 0.0088 0.9563 0.1346 0.4264 7.0663 0.4917 7.8998 1.7580 1.8310 3.2140 18.1341 17.0746 44.1258 3.1313 47.9051 0.4436 23.7296 14.6908 0.6857 1.5985 2.3260 1.5098 0.0154 11.7049 0.1019 12.6498 9.2371 47.6552 0.0181 0.1507 3.4943 14.6010 10.7448 13.1363 4.9417 10.4436 8.9959 4.9268 11.8700 30.6587 14.8503 12.2897 21.8371 16.6903 18.9121 38.3311 0.9713 27.2138 1.0793 16.1060 9.1110 35.9936 9.7334
temp: 298.150 k
press: 1.00000 atm
elementType: 9 6 6 6 6 6 6 6 6 6 6 6 6 1 1 1 1 1 1 1 1 1
symmnumber: 1
zpe: 449587.6 jmol-1
zpe.correction: 0.171239 hartree
zpe.thermalcorrener: 0.180663 hartree
zpe.thermalcorrenthalpy: 0.181607 hartree
zpe.thermalcorrgfe: 0.136453 hartree
zpe.sumelectzpe: -561.644752 hartree
zpe.sumelectthermal: -561.635328 hartree
zpe.sumelectthermalent: -561.634384 hartree
zpe.sumelectthermalfe: -561.679538 hartree
dipole: 1.9177 0.4345 0.0001
dipole: 1.9663
quadrupole: -76.1116 -62.3398 -77.9953
quadrupole: 1.7917 0.0000 0.0003
quadrupole: -3.9627 9.8091 -5.8464 1.7917 0.0000 0.0003
hfenergy: -561.8159907 hartree
pointgroup: C01[X(C12H9F1)]
dipole: 0.7548997 -0.169093 -0.0000337 debye
dipolederiv: -1.1655904 -0.1301109 0.0000457 -0.3218651 -0.2492448 0.0000171 0.0000622 0.0000157 -0.1482355 0.0508875 0.0208481 -0.0000043 -0.0318616 -0.2158818 -0.0000021 -0.0000301 -0.0000014 -0.041408 0.0608864 -0.0846526 0.0000359 0.0217082 -0.0623937 0.0000276 0.0000364 0.0001637 0.1678235 0.0422133 0.0212415 0.0000218 -0.1023367 -0.0748488 -0.0000431 -0.0000231 -0.0001721 0.1559643 -0.2733058 -0.060845 0.0000076 0.1577646 0.2268763 -0.0000367 0.0000015 -0.0001181 -0.0485527 -0.0208394 0.119276 0.0000245 0.0616074 0.3280852 0.000039 0.0000328 0.0001215 -0.035386 0.1713603 -0.025036 0.0000035 -0.0415832 -0.1492043 -0.0000017 0.0000194 -0.000006 0.0837042 1.2589282 0.2503091 -0.0000616 0.2855635 0.140675 -0.0000154 -0.0000762 -0.0000089 0.0524073 -0.030475 -0.2056863 -0.0000233 -0.0829924 -0.0563443 0.0000078 -0.0000167 0.000002 -0.1889177 -0.0242697 -0.0611256 -0.0000068 -0.0179486 0.1087867 0.0000103 -0.0000014 0.0000125 -0.1892003 -0.0797071 0.0421366 -0.0000046 0.103859 0.0536352 -0.000002 -0.0000007 0.0000017 -0.2007107 -0.1357246 -0.0013726 0.0000083 -0.0895362 0.0383833 0.0000037 0.0000136 -0.0000053 -0.1459627 0.063832 0.1006311 0.0000083 0.0222164 0.0676926 0.0000063 0.0000082 0.0000069 -0.1464632 0.0266133 -0.0157973 0.0671731 -0.0335006 0.0022688 0.0550441 0.0892021 0.1032631 -0.0274222 0.0265067 -0.0158917 -0.0672121 -0.0335634 0.0022457 -0.055055 -0.0892188 -0.1032806 -0.0272539 0.0361162 0.0003367 0.0431816 0.0209114 -0.0243752 -0.082712 0.0503368 -0.1396749 -0.0331983 0.0360657 0.0004458 -0.0432158 0.0209884 -0.0244829 0.082733 -0.0503509 0.1397046 -0.0330266 -0.0282663 0.0957617 0.0000096 0.1165564 -0.0129395 -0.0000109 0.000013 -0.0000149 0.1571866 0.0707292 -0.0480921 0.0000017 0.0053847 -0.0993562 -0.000002 -0.0000027 -0.0000005 0.1598088 0.0608708 -0.017862 0.0000017 -0.0766182 -0.1029738 -0.0000048 -0.0000057 -0.0000065 0.1617361 -0.0126557 0.0854302 0.0000042 0.0811076 0.0385013 -0.0000008 0.0000012 -0.0000031 0.1712667 -0.1341757 -0.0699449 0.000001 -0.0658615 0.0648953 -0.0000024 -0.0000009 0.0000004 0.1558402 unknown
polarizability: 171.8515827|-3.4934206|147.0846117|-0.0043828|0.0015037|57.2950465 unknown
InChI: InChI=1S/C12H9F/c13-11-7-5-9-3-1-2-8-4-6-10(11)12(8)9/h1-3,5,7H,4,6H2
charge 0 multiplicity 1
22 atoms
F  -3.450128 -0.242939 0.000118
C  0.253009 -0.113806 -0.000075
C  -0.966239 -2.193746 0.000133
C  0.585343 -2.495187 -0.000302
C  -1.05873 -0.673256 0.000014
C  1.261823 -1.12344 -0.00017
C  0.530483 1.290098 -0.000061
C  -2.115689 0.224599 0.000042
C  2.60085 -0.72883 -0.000167
C  -0.608156 2.166792 -0.000024
C  1.916363 1.66538 -0.000078
C  -1.906713 1.638504 0.000012
C  2.911238 0.676498 -0.00012
H  -1.464539 -2.62764 0.886381
H  -1.465164 -2.627927 -0.885613
H  0.876188 -3.08832 -0.887441
H  0.876645 -3.08884 0.886331
H  3.415438 -1.461926 -0.000216
H  -0.465167 3.253191 -0.000019
H  2.195411 2.725586 -0.000055
H  -2.78326 2.294613 0.00003
H  3.964897 0.979895 -0.00012
