program: Gaussian 09
title: 000145719
version: EM64L-G09RevD.01
frameworkgroup: C1[X(C17H19FN2S)]
method: RPBEPBE
basis: SDD
operation: Freq
keyword: #p
keyword: freq=noraman
keyword: PBEPBE/SDD
title: #p freq=noraman PBEPBE/SDD
converged: YES YES NO NO
title: Mulliken charges:
elementType: S F N N C C C C C C C C C C C C C C C C C H H H H H H H H H H H H H H H H H H H
charge: 0.225741 -0.209401 -0.290916 -0.103881 -0.399746 -0.432315 -0.343571 0.568785 0.492342 -0.406815 -0.347607 -0.494444 -0.326995 -0.228410 -0.268672 -0.617823 -0.610461 0.341565 -0.238094 -0.412164 -0.253309 0.209630 0.256126 0.207878 0.241477 0.190122 0.232016 0.276377 0.242271 0.251100 0.247342 0.223995 0.190866 0.221972 0.239177 0.188931 0.218022 0.227872 0.259000 0.232018
chargesum: 0.00000
title: Mulliken charges with hydrogens summed into heavy atoms:
elementType: S F N N C C C C C C C C C C C C C C C C C
charge: 0.225741 -0.209401 -0.290916 -0.103881 0.066010 0.017040 0.078566 0.568785 0.492342 -0.406815 -0.347607 -0.218067 -0.084723 0.022690 -0.021331 0.019010 0.035669 0.341565 -0.010223 -0.153164 -0.021290
polarizability: 2.52611545e+02 4.67088059e+01 2.19531442e+02 -3.10064679e+01 1.90567395e+01 1.71528452e+02
1716.lowfreq: -15.1360 -8.0314 -5.9486 -0.0012 0.0008 0.0009 14.2860 24.7104 32.9551
frequency: 12.8392 24.3793 32.5151 48.4225 68.4279 93.9230 117.4929 129.5881 162.4478 206.9472 219.0129 223.0866 226.3529 264.7883 290.4393 306.7760 321.9163 335.9070 357.7937 375.9983 389.1987 405.8256 413.2710 434.3895 438.1259 443.8673 483.3411 515.3379 529.7394 561.8357 593.6605 609.3601 630.3114 667.6876 690.5326 711.9979 724.5970 740.3186 754.2780 793.8466 809.7845 834.5986 848.4471 853.1827 876.4900 924.0676 930.8136 946.5426 970.6370 972.3832 1008.2171 1023.4954 1035.0072 1035.8824 1043.5412 1073.4593 1075.5988 1088.9822 1099.0488 1115.1381 1132.4026 1136.9785 1142.2277 1166.3132 1174.5277 1212.9054 1239.5521 1252.6009 1260.1788 1267.7472 1280.4380 1299.6622 1318.2372 1346.0904 1355.0425 1367.8359 1374.6437 1384.9027 1415.2554 1418.1641 1429.7064 1438.9775 1456.8878 1457.7299 1462.3234 1468.9875 1474.4588 1476.4803 1477.8939 1484.0501 1485.1596 1570.8945 1583.7421 1588.7868 1617.6513 2851.3421 2857.0599 2873.1467 2954.1849 2997.1994 3020.0864 3023.4023 3028.3644 3052.3291 3076.2927 3077.7358 3081.5378 3132.8031 3142.9950 3152.6297 3159.1590 3171.4541 3182.3829 3186.7700
redmass: 4.3275 4.0025 2.8000 7.0558 3.4973 4.5039 5.2802 3.9097 3.1938 2.7932 1.2665 1.6399 2.9408 3.0170 5.7879 2.7977 6.1727 4.9100 3.3912 3.8474 2.4889 2.9920 3.0781 3.8628 4.3483 3.3884 3.4439 3.3696 4.3022 3.9245 4.9752 6.7568 5.0216 6.1638 5.0300 4.5912 3.5994 2.2251 1.4924 1.3673 5.4088 1.8213 1.4822 1.4618 2.7323 1.3355 1.3749 3.2259 2.0426 1.3633 2.5787 5.5732 2.8024 1.6979 2.1881 1.8718 2.2479 1.4621 2.6817 1.5036 1.4318 1.5046 1.7136 1.9445 1.0833 1.4816 1.5074 2.2647 1.6021 2.1694 2.3207 1.3866 1.9227 1.3828 1.4374 1.4867 4.3232 9.1738 2.9462 1.1777 2.3659 1.1516 1.4383 1.6739 1.0521 1.1041 1.1870 1.1312 1.4958 1.3843 1.0683 6.2782 7.0058 7.2216 7.8260 1.0571 1.0643 1.0623 1.0685 1.0627 1.0736 1.0727 1.0882 1.0989 1.0941 1.0997 1.1006 1.0851 1.0903 1.0898 1.0940 1.1002 1.0916 1.0961
irintensity: 0.1382 0.2665 0.7365 0.1112 0.2504 1.5002 0.6149 0.2443 0.9673 0.1840 0.9515 1.1282 0.5552 1.9255 1.7235 6.6171 1.2794 2.5028 6.8077 10.4796 0.8882 0.3795 3.2542 11.5159 3.9146 0.1608 7.6585 3.4553 4.6951 12.3616 3.5470 9.0953 1.9664 4.5096 2.8753 1.8297 0.7889 70.1323 55.6141 29.8439 1.1241 9.1688 49.1029 7.5253 5.3248 0.3661 1.9760 69.4453 11.2490 1.9705 3.4347 30.5373 16.2238 9.1867 9.1413 13.3642 4.7198 0.8833 16.0287 56.5077 10.0225 25.9502 35.5691 7.3172 0.8812 57.0999 22.7029 54.6887 11.1962 12.7055 13.3660 9.2666 80.4371 7.5174 2.0155 3.1954 15.5566 7.7030 33.2922 0.9586 4.9982 4.1158 167.6924 154.6357 19.3710 14.3269 8.9334 11.5775 41.8567 7.9432 13.3190 34.6623 51.6411 47.7379 63.7811 78.0617 53.3050 254.8050 48.3783 35.9564 29.5904 44.8970 10.0353 36.8281 13.6584 18.7049 48.0180 1.2480 8.7993 3.3416 22.6505 19.0270 1.4351 2.0698
temp: 298.150 k
press: 1.00000 atm
elementType: 16 9 7 7 6 6 6 6 6 6 6 6 6 6 6 6 6 6 6 6 6 1 1 1 1 1 1 1 1 1 1 1 1 1 1 1 1 1 1 1
symmnumber: 1
zpe: 843105.3 jmol-1
zpe.correction: 0.321122 hartree
zpe.thermalcorrener: 0.340864 hartree
zpe.thermalcorrenthalpy: 0.341809 hartree
zpe.thermalcorrgfe: 0.270853 hartree
zpe.sumelectzpe: -1265.059907 hartree
zpe.sumelectthermal: -1265.040164 hartree
zpe.sumelectthermalent: -1265.039220 hartree
zpe.sumelectthermalfe: -1265.110175 hartree
dipole: 2.7238 -0.4340 -0.2098
dipole: 2.7661
quadrupole: -131.5555 -125.9766 -128.8435
quadrupole: -5.2168 -8.0555 1.0701
quadrupole: -2.7636 2.8152 -0.0516 -5.2168 -8.0555 1.0701
hfenergy: -1265.3810287 hartree
pointgroup: C01 [X(C17H19F1N2S1)]
dipole: 1.0088919 -0.4045844 -0.0529237 debye
polarizability: 273.1703672|34.348235|199.5359412|-21.173086|27.5616004|170.9651314 unknown
InChI: InChI=1S/C17H19FN2S/c1-19(2)10-5-11-20-14-6-3-4-7-16(14)21-17-9-8-13(18)12-15(17)20/h3-4,6-9,12H,5,10-11H2,1-2H3
charge 0 multiplicity 1
40 atoms
S  -0.349696 1.768362 1.859157
F  -4.714725 -1.033747 -1.183561
N  0.037147 -0.096127 -0.532305
N  2.497733 -2.625435 0.619998
C  0.43587 -1.3597 -1.201966
C  0.161402 -2.601071 -0.321955
C  1.049432 -2.603004 0.943252
C  -1.327797 0.105463 -0.185885
C  0.939096 1.016583 -0.526036
C  -1.686157 1.012017 0.854913
C  0.854229 2.007259 0.491309
C  -2.372773 -0.570037 -0.873476
C  1.924771 1.18385 -1.536282
C  -3.0339 1.259162 1.17855
C  1.714565 3.12204 0.503586
C  2.975229 -3.957287 0.197251
C  3.334291 -2.055558 1.696898
C  -3.702074 -0.331468 -0.494341
C  2.81442 2.279198 -1.503059
C  -4.075011 0.570859 0.512774
C  2.715291 3.254663 -0.486235
H  -0.044492 -1.462038 -2.197826
H  1.527715 -1.326027 -1.34848
H  0.353847 -3.503466 -0.93433
H  -0.899856 -2.648853 -0.015044
H  0.758419 -3.463385 1.597476
H  0.840956 -1.678361 1.51315
H  -2.167532 -1.26204 -1.692988
H  1.992063 0.463643 -2.356614
H  -3.273365 1.974793 1.971163
H  1.610271 3.873804 1.293135
H  4.035122 -3.893021 -0.108245
H  2.894007 -4.727917 1.006117
H  2.397299 -4.316674 -0.672119
H  3.000419 -1.027136 1.920156
H  3.302435 -2.647481 2.646452
H  4.386727 -2.007783 1.362687
H  3.574165 2.376781 -2.286143
H  -5.126666 0.724381 0.766275
H  3.397824 4.110262 -0.465207
