program: Gaussian 09
title: 000145705
version: EM64L-G09RevD.01
frameworkgroup: C1[X(C10H11ClN2)]
method: RPBEPBE
basis: SDD
operation: Freq
keyword: #p
keyword: freq=noraman
keyword: PBEPBE/SDD
title: #p freq=noraman PBEPBE/SDD
converged: YES YES NO NO
title: Mulliken charges:
elementType: Cl N N C C C C C C C C C C H H H H H H H H H H H
charge: -0.079224 -0.413989 -0.572450 0.394803 0.112154 -0.528710 0.257965 -0.431960 -0.392833 -0.394758 -0.343478 -0.252194 -0.066602 0.232105 0.199468 0.270625 0.308540 0.220169 0.200797 0.236057 0.256221 0.248539 0.277517 0.261236
chargesum: 0.00000
title: Mulliken charges with hydrogens summed into heavy atoms:
elementType: Cl N N C C C C C C C C C C
charge: -0.079224 -0.105448 -0.033696 0.394803 0.112154 -0.097137 0.257965 -0.161334 0.028133 -0.158701 -0.087257 -0.003655 -0.066602
polarizability: 1.90111405e+02 -1.34130343e+01 1.35246023e+02 6.67084537e+00 7.91072271e+00 6.79153276e+01
1716.lowfreq: -12.9703 -9.8693 -0.0010 0.0008 0.0015 4.7294 51.7859 60.9903 83.2293
frequency: 51.6810 60.9858 83.2181 127.1203 185.9107 211.0317 216.5904 253.2002 283.4303 334.4489 370.6823 392.5428 422.2607 465.6787 513.3821 576.5225 589.4774 591.4597 609.8400 653.9906 740.2586 750.5059 772.0763 795.3723 803.0728 809.0316 851.3559 885.0176 937.3915 940.6592 1014.9224 1050.7582 1065.7097 1094.4785 1097.7416 1120.4551 1142.8657 1219.0388 1235.7665 1240.5393 1280.9159 1291.7730 1313.2304 1330.6761 1379.0543 1389.9239 1398.6816 1460.2450 1466.1586 1468.4276 1491.8133 1560.1165 1583.2817 1624.3848 1637.7576 2887.4226 2962.3743 3027.8829 3055.0778 3139.0216 3161.5752 3173.4629 3221.9586 3456.1940 3583.7022 3614.1073
redmass: 3.8079 5.5402 1.9014 5.2908 3.7699 1.4599 2.4912 5.0197 5.0730 3.5367 6.5028 6.1617 2.8984 3.6181 1.1695 5.6890 2.9427 1.6151 2.7979 4.4167 4.2635 3.0881 2.4274 1.5921 1.4199 1.8164 1.4653 5.3058 1.4533 1.6427 2.2589 2.0023 3.2807 2.8019 1.7238 1.3580 1.3905 1.4753 1.5382 2.0951 1.4116 1.4048 1.4710 1.7953 1.3916 5.8853 2.9546 4.9339 1.1052 3.1207 1.0867 7.1438 6.7169 7.0225 1.0946 1.0712 1.0665 1.0870 1.0973 1.0893 1.0932 1.0957 1.0985 1.0449 1.0975 1.0810
irintensity: 1.8956 0.8574 4.7688 0.0205 4.8252 43.5489 7.2865 0.8419 8.4426 8.8067 21.5929 2.6583 12.0977 1.8349 116.4556 6.6478 54.6443 172.1148 31.5643 8.9621 5.7471 1.3432 12.4799 10.0060 65.0598 16.6803 28.4074 35.8498 1.0098 2.9223 3.0066 15.8802 14.4449 8.6380 61.7686 2.7011 4.6079 4.4430 19.3914 1.6342 0.2293 4.8307 1.5799 26.5041 16.4608 36.2128 1.9557 27.3617 6.3081 17.6733 5.1891 10.7587 2.6290 28.6141 39.1538 104.7627 36.7856 23.1590 36.6006 9.5620 2.2277 5.5442 0.8519 0.7075 0.3319 63.0176
temp: 298.150 k
press: 1.00000 atm
elementType: 17 7 7 6 6 6 6 6 6 6 6 6 6 1 1 1 1 1 1 1 1 1 1 1
symmnumber: 1
zpe: 499558.7 jmol-1
zpe.correction: 0.190272 hartree
zpe.thermalcorrener: 0.202425 hartree
zpe.thermalcorrenthalpy: 0.203369 hartree
zpe.thermalcorrgfe: 0.151183 hartree
zpe.sumelectzpe: -956.286310 hartree
zpe.sumelectthermal: -956.274157 hartree
zpe.sumelectthermalent: -956.273212 hartree
zpe.sumelectthermalfe: -956.325399 hartree
dipole: -2.2178 1.4709 0.5843
dipole: 2.7246
quadrupole: -93.9932 -64.4320 -86.1869
quadrupole: 8.5673 -1.8593 2.9023
quadrupole: -12.4558 17.1053 -4.6495 8.5673 -1.8593 2.9023
hfenergy: -956.4765816 hartree
pointgroup: C01 [X(C10H11Cl1N2)]
dipole: -0.8641578 -0.6097972 -0.174559 debye
dipolederiv: -0.8770069 -0.2054271 0.0867142 -0.1496088 -0.1825588 0.0100105 0.1037285 0.0210539 -0.0962357 -0.5639605 0.2873281 0.0272396 -0.1256194 -0.5824968 -0.0057467 0.0322633 -0.0837386 -0.2833581 -0.9449424 0.0393259 0.1256333 0.022765 -0.4947856 0.1311441 0.1228444 0.1264298 -0.2738937 0.1861854 -0.1597408 -0.0355256 -0.0527411 -0.1360326 0.0137579 -0.0704716 0.0414255 -0.1355477 0.1738329 0.335461 0.0146104 -0.0301157 -0.2128275 -0.0099716 -0.0227353 -0.0686424 -0.0131499 0.0835893 0.0618285 -0.0142545 0.0519151 0.059117 0.0689794 -0.1444027 0.0961215 0.1041944 -0.0601287 0.0732846 0.0184092 0.4269846 0.4560724 -0.0006976 0.0548534 0.0283023 0.0367526 0.181838 -0.4352276 -0.0920351 -0.2561823 0.1642815 0.0628542 -0.0824173 0.1048231 -0.1622386 0.6734935 -0.0724858 -0.0614398 -0.1942195 0.3622596 -0.00517 0.0468038 -0.0406577 0.1677774 0.1385209 0.0014643 -0.0357261 0.1084921 0.129224 0.0056934 -0.0301397 0.0270584 -0.13988 -0.1924448 -0.0903764 -0.0065939 -0.0175101 -0.0938787 0.0096706 0.0068637 0.0186948 -0.1493487 -0.4249245 -0.0607403 0.0312896 -0.0337784 -0.0230476 0.0176594 0.0337711 0.0211538 -0.1524074 1.1660053 0.2421906 -0.1522297 0.0958623 0.2161808 0.0187273 -0.1769987 -0.0063282 -0.054779 -0.0522854 -0.0687641 0.0587647 -0.103078 -0.030974 0.0643791 0.0284783 0.0378638 0.054015 0.0289365 -0.0062674 -0.0258886 0.0720805 -0.0452272 -0.1427936 0.0173513 -0.0952744 -0.0698289 0.0330978 -0.0695949 0.0222785 -0.0686833 0.026021 -0.0083731 0.0206742 -0.0072361 0.1960041 0.1382686 0.0073187 0.0287958 0.0021328 0.2327358 -0.0136114 0.0321122 -0.008112 0.3402014 0.0238368 0.0057122 -0.0319688 -0.0254468 -0.0190402 -0.1270117 0.0043208 -0.0961976 -0.0744334 -0.2423528 -0.0681498 0.103038 -0.1295073 -0.0583888 0.0777438 0.0797282 0.0336644 0.0012363 -0.0058878 0.101361 0.0339899 0.0885861 -0.0106023 -0.0224367 0.0381293 -0.0276273 0.1379514 0.0288157 0.0544656 0.0276304 0.0739621 0.0105959 -0.0288472 0.0313439 -0.026472 0.1788467 0.0698159 -0.0613536 0.0070047 -0.0546449 -0.0397525 -0.0159061 0.0095893 -0.0138811 0.1686521 0.2281054 0.0988468 -0.0305773 0.2379974 0.1652626 0.0655488 -0.0954649 0.0433453 0.0604137 0.2095919 -0.0104593 -0.0991589 0.0603576 0.107862 -0.1656028 -0.0402255 -0.1257692 0.1590558 unknown
polarizability: 189.138593|14.180949|136.5264069|-10.3206296|3.2709282|67.6077556 unknown
InChI: InChI=1S/C10H11ClN2/c11-8-1-2-9-7(3-4-12)6-13-10(9)5-8/h1-2,5-6,13H,3-4,12H2
charge 0 multiplicity 1
24 atoms
Cl 4.478896 0.926474 -0.365959
N  0.224141 -2.272997 -0.062102
N  -4.470359 1.4733 -0.337177
C  -1.336443 -0.640325 0.337061
C  -0.02761 -0.018761 0.200838
C  -2.651357 0.056254 0.584776
C  0.929753 -1.06775 -0.048193
C  -1.137722 -2.010542 0.171597
C  -3.175429 0.837764 -0.650427
C  0.433747 1.32229 0.275165
C  2.309413 -0.816695 -0.225943
C  1.804422 1.596185 0.103494
C  2.706027 0.526836 -0.143811
H  -3.432485 -0.668525 0.876823
H  -2.548145 0.767428 1.431475
H  -1.865572 -2.81941 0.207654
H  0.630069 -3.194646 -0.205492
H  -3.331791 0.123447 -1.479792
H  -2.385164 1.551029 -0.987703
H  -0.263139 2.145278 0.467277
H  3.035635 -1.612234 -0.415624
H  2.184333 2.620045 0.157738
H  -4.986926 1.814515 -1.153021
H  -4.420896 2.177839 0.406045
