program: Gaussian 09
title: 000145701
version: EM64L-G09RevD.01
frameworkgroup: C1[X(C17H16O2)]
method: RPBEPBE
basis: SDD
operation: Freq
keyword: #pfreq=noraman
keyword: PBEPBE/SDD
title: #p freq=noraman PBEPBE/SDD
converged: YES YES NO NO
title: Mulliken charges:
elementType: O O C C C C C C C C C C C C C C C C C H H H H H H H H H H H H H H H H
charge: -0.230186 -0.230923 -0.689102 0.304182 0.303941 0.143148 0.144000 0.443380 0.443492 -0.346601 -0.345584 -0.357371 -0.356874 -0.415125 -0.414907 -0.381802 -0.382197 -0.805094 -0.804794 0.260335 0.260626 0.284751 0.283346 0.273871 0.273983 0.236436 0.236416 0.234735 0.234703 0.229071 0.230292 0.240368 0.229349 0.228551 0.241582
chargesum: 0.00000
title: Mulliken charges with hydrogens summed into heavy atoms:
elementType: O O C C C C C C C C C C C C C C C C C
charge: -0.230186 -0.230923 -0.168141 0.304182 0.303941 0.143148 0.144000 0.443380 0.443492 -0.061850 -0.062237 -0.083500 -0.082891 -0.178690 -0.178491 -0.147067 -0.147494 -0.105362 -0.105312
polarizability: 2.87546095e+02 2.05564980e+01 1.85646940e+02 8.77808081e-01 1.70062857e-01 1.25959491e+02
1716.lowfreq: -43.6578 -8.0554 -7.1872 -2.7611 -0.0006 0.0003 0.0005 14.4456 20.2929
frequency: -43.5446 14.4344 20.1424 46.9713 54.0937 61.8414 99.3488 103.3266 117.5833 159.8145 213.1985 257.9568 260.2730 306.0009 339.5949 341.9678 364.7279 404.5778 405.7617 444.4316 463.4911 471.5247 474.8836 513.1230 570.6901 625.0380 628.3024 632.8449 639.4337 688.1575 714.8103 732.0690 781.6423 801.5486 804.5378 841.1292 856.8074 860.6150 862.9212 934.9067 970.7352 980.8815 986.5577 988.5902 992.4183 996.4159 998.1474 1007.8059 1013.6243 1045.6459 1046.4841 1047.2524 1123.9573 1128.7316 1144.5846 1194.4200 1201.7336 1226.4729 1227.2287 1236.3948 1263.8684 1299.3461 1316.9589 1318.7359 1372.3161 1372.8881 1395.7571 1395.9498 1413.9791 1414.7598 1466.7445 1467.3643 1467.5550 1471.5272 1472.2593 1503.8171 1506.4197 1544.9730 1561.3757 1584.3576 1587.8263 1618.6470 1622.2234 2976.2877 2976.5503 3041.2252 3058.1827 3058.4331 3089.3839 3089.9303 3110.6277 3125.3781 3125.7674 3128.0152 3128.4427 3150.3146 3150.4797 3159.0012 3159.1880
redmass: 1.0147 4.8397 1.0329 3.8377 4.8845 4.6841 4.7795 5.1632 7.0069 5.4182 4.4953 4.4424 4.2829 5.6391 2.9185 3.2990 4.4638 2.8613 2.8713 4.2437 2.9917 3.9362 3.3292 3.6031 4.4831 4.0509 6.2685 6.9208 5.8850 3.3511 3.4514 2.9556 3.2843 3.3450 3.9193 1.4502 1.5291 1.2621 1.6662 2.5454 2.1576 1.3662 1.4609 1.4167 1.6142 1.4036 1.5905 3.1510 2.6406 1.7824 1.6644 2.3291 1.3660 1.3132 1.3639 1.2349 1.1403 2.9406 2.9824 2.1740 1.7124 3.0270 1.2955 1.2889 4.7128 4.8308 1.2222 1.2229 3.5535 3.4657 1.1220 1.1091 1.1124 1.0574 1.0585 2.5101 2.3807 8.4433 6.0907 6.6955 7.3191 6.1324 6.3558 1.0391 1.0391 1.0575 1.0942 1.0941 1.1000 1.1000 1.1045 1.0890 1.0890 1.0890 1.0889 1.0963 1.0964 1.0957 1.0958
irintensity: 0.5466 1.8131 0.4871 0.2710 3.8885 0.4722 0.2959 1.0008 1.7003 4.1512 13.2957 1.8674 0.5715 0.6060 4.4109 0.8685 0.0588 0.4484 0.1752 1.2863 8.5345 4.6344 9.2722 39.5281 38.4175 0.1767 0.0062 1.0883 0.9042 11.1590 0.5626 0.7126 10.7167 15.2969 10.0052 43.7696 20.6250 2.0223 29.6557 88.2883 11.4643 8.8366 1.3028 0.4489 3.1431 8.5994 0.0747 38.0035 0.0224 57.0912 40.0457 41.7630 7.9922 34.2234 3.5957 224.2033 4.3175 0.1582 0.9046 387.2026 128.3403 56.6387 0.3295 4.6624 1.0694 8.3137 16.2673 14.0694 4.0119 23.3426 15.6739 24.7555 15.9205 12.6522 14.1046 18.5598 1.5742 315.8639 8.7137 89.5682 6.9166 134.5344 19.2384 27.9544 22.5061 4.4665 22.1049 19.9404 15.1967 15.5633 9.4068 17.2614 17.1052 7.7288 10.1979 14.3250 6.4013 20.1513 2.3193
temp: 298.150 k
press: 1.00000 atm
elementType: 8 8 6 6 6 6 6 6 6 6 6 6 6 6 6 6 6 6 6 1 1 1 1 1 1 1 1 1 1 1 1 1 1 1 1
symmnumber: 1
zpe: 732350.6 jmol-1
zpe.correction: 0.278938 hartree
zpe.thermalcorrener: 0.296018 hartree
zpe.thermalcorrenthalpy: 0.296962 hartree
zpe.thermalcorrgfe: 0.230954 hartree
zpe.sumelectzpe: -806.527249 hartree
zpe.sumelectthermal: -806.510169 hartree
zpe.sumelectthermalent: -806.509225 hartree
zpe.sumelectthermalfe: -806.575233 hartree
dipole: 0.0566 -0.0289 -1.1975
dipole: 1.1992
quadrupole: -77.9671 -116.1302 -108.9820
quadrupole: 3.4997 0.6135 0.0499
quadrupole: 23.0593 -15.1038 -7.9555 3.4997 0.6135 0.0499
hfenergy: -806.806187 hartree
pointgroup: C01[X(C17H16O2)]
dipole: 0.0392492 -0.3598248 0.3026391 debye
polarizability: 287.3295823|-7.5126094|148.5293188|-20.110704|28.7598674|163.2936254 unknown
InChI: InChI=1S/C17H16O2/c1-12-3-7-14(8-4-12)16(18)11-17(19)15-9-5-13(2)6-10-15/h3-10H,11H2,1-2H3
charge 0 multiplicity 1
35 atoms
O  0.367124 2.607272 1.085676
O  -0.420244 -0.154461 -2.315936
C  -0.059941 1.991492 -1.228973
C  2.095717 1.264683 0.070635
C  -2.116033 0.452578 -0.711391
C  0.789127 1.986737 0.062705
C  -0.852115 0.686985 -1.46993
C  4.614857 -0.084584 0.192418
C  -4.553287 -0.097639 0.682463
C  2.539538 0.466643 -1.019818
C  -2.572099 1.324232 0.31573
C  2.921629 1.371715 1.225107
C  -2.890953 -0.698629 -1.029131
C  3.779768 -0.199417 -0.949763
C  -3.773028 1.045105 0.999014
C  4.159796 0.710119 1.281393
C  -4.090104 -0.963766 -0.346968
C  5.965558 -0.772581 0.244457
C  -5.8324 -0.402642 1.438295
H  -0.752342 2.844988 -1.149449
H  0.589394 2.134891 -2.107706
H  1.907772 0.335708 -1.904714
H  -1.983116 2.201879 0.602627
H  2.56298 1.979086 2.062819
H  -2.527671 -1.364556 -1.818978
H  4.104962 -0.821562 -1.791969
H  -4.110698 1.723204 1.79165
H  4.786729 0.80345 2.176377
H  -4.680751 -1.849837 -0.609349
H  6.223496 -1.08269 1.272401
H  5.991904 -1.665942 -0.403111
H  6.767162 -0.090932 -0.101711
H  -6.291081 0.514025 1.847519
H  -6.575778 -0.903857 0.793767
H  -5.631273 -1.079098 2.292143
